check poles error "launch auto "

Asked by Nikhil Bachhawat on 2021-03-22

Hi,

I am trying to generate events for the process generate e+ e- > neutrino neutrino b b~ b b~ [QCD] where neutrino = vl vl~ .

I have attached the error that I get below. But there seems to be an error when it checks poles.

Can you please help with this?

Thanks,
Nikhil

INFO: Compiling the code
Lepton-lepton collisions: ignoring PDF related parameters in the run_card.dat (pdlabel, lhaid, reweight_pdf, ...)
INFO: Compiling source...
INFO: ...done, continuing with P* directories
INFO: Compiling directories...
INFO: Compiling on 64 cores
INFO: Compiling P0_epem_vevexbbbxbx...
INFO: Compiling P0_epem_vmvmxbbbxbx...
WARNING: fct <function compile_dir at 0x7f88c01d0430> does not return 0. Stopping the code in a clean way. The error was:
A compilation Error occurs when trying to compile /mnt/e/mg5_amc_v2_9_2/ee4bnunu_qcd/SubProcesses/P0_epem_vmvmxbbbxbx.
The compilation fails with the following output message:
    gfortran -O -fno-automatic -ffixed-line-length-132 -c -I. -I../../lib/ check_poles.f
    check_poles.f:305:132:

      305 | 101 Z(K)=Z(K-1)+PO2LOG-2.*LOG(DFLOAT(K-2))
          | 1
    Warning: Fortran 2018 deleted feature: DO termination statement which is not END DO or CONTINUE with label 101 at (1)
    check_poles.f:307:132:

      307 | 102 Z(K)=(Z(K)-LOG(DFLOAT(K-1)))
          | 1
    Warning: Fortran 2018 deleted feature: DO termination statement which is not END DO or CONTINUE with label 102 at (1)
    check_poles.f:319:132:

      319 | 105 XMT=XMT+ABS(XM(I))
          | 1
    Warning: Fortran 2018 deleted feature: DO termination statement which is not END DO or CONTINUE with label 105 at (1)
    check_poles.f:359:132:

      359 | 202 Q(1,I)=Q(4,I)*S*SIN(F)
          | 1
    Warning: Fortran 2018 deleted feature: DO termination statement which is not END DO or CONTINUE with label 202 at (1)
    check_poles.f:363:132:

      363 | 203 R(I)=0.
          | 1
    Warning: Fortran 2018 deleted feature: DO termination statement which is not END DO or CONTINUE with label 203 at (1)
    check_poles.f:365:132:

      365 | DO 204 K=1,4
          | 1
    Warning: Fortran 2018 deleted feature: Shared DO termination label 204 at (1)
    check_poles.f:366:132:

      366 | 204 R(K)=R(K)+Q(K,I)
          | 1
    Warning: Fortran 2018 deleted feature: DO termination statement which is not END DO or CONTINUE with label 204 at (1)
    check_poles.f:369:132:

      369 | 205 B(K)=-R(K)/RMAS
          | 1
    Warning: Fortran 2018 deleted feature: DO termination statement which is not END DO or CONTINUE with label 205 at (1)
    check_poles.f:378:132:

      378 | 206 P(K,I)=X*(Q(K,I)+B(K)*(Q(4,I)+A*BQ))
          | 1
    Warning: Fortran 2018 deleted feature: DO termination statement which is not END DO or CONTINUE with label 206 at (1)
    check_poles.f:379:132:

      379 | 207 P(0,I)=X*(G*Q(4,I)+BQ)
          | 1
    Warning: Fortran 2018 deleted feature: DO termination statement which is not END DO or CONTINUE with label 207 at (1)
    check_poles.f:401:132:

      401 | 301 P2(I)=P(0,I)**2
          | 1
    Warning: Fortran 2018 deleted feature: DO termination statement which is not END DO or CONTINUE with label 301 at (1)
    check_poles.f:411:132:

      411 | 303 G0=G0+P2(I)/E(I)
          | 1
    Warning: Fortran 2018 deleted feature: DO termination statement which is not END DO or CONTINUE with label 303 at (1)
    check_poles.f:422:132:

      422 | 306 P(K,I)=X*P(K,I)
          | 1
    Warning: Fortran 2018 deleted feature: DO termination statement which is not END DO or CONTINUE with label 306 at (1)
    check_poles.f:423:132:

      423 | 307 P(0,I)=E(I)
          | 1
    Warning: Fortran 2018 deleted feature: DO termination statement which is not END DO or CONTINUE with label 307 at (1)
    check_poles.f:430:132:

      430 | 308 WT3=WT3+V(I)**2/E(I)
          | 1
    Warning: Fortran 2018 deleted feature: DO termination statement which is not END DO or CONTINUE with label 308 at (1)
    run.inc:74:21:

       74 | common/to_rwgt/ do_rwgt_scale, rw_Fscale_down, rw_Fscale_up, rw_Rscale_down, rw_Rscale_up,
          | 1
    Warning: Padding of 4 bytes required before ‘rw_fscale_down’ in COMMON ‘to_rwgt’ at (1); reorder elements or use ‘-fno-align-commons’ [-Walign-commons]
    gfortran -O -fno-automatic -ffixed-line-length-132 -c -I. -I../../lib/ BinothLHA.f
    gfortran -O -fno-automatic -ffixed-line-length-132 -c -I. -I../../lib/ born_hel.f
    for dir in `ls -d V*`; do cd $dir; make; cd ../; done
    make[1]: Entering directory '/mnt/e/mg5_amc_v2_9_2/ee4bnunu_qcd/SubProcesses/P0_epem_vmvmxbbbxbx/V0_epem_vmvmxbbbxbx'
    rm -f ../libMadLoop.a
    gfortran -fno-automatic -ffixed-line-length-132 -O3 -c polynomial.f -o polynomial.o
    gfortran -O -fno-automatic -ffixed-line-length-132 -c loop_matrix.f -I /mnt/e/mg5_amc_v2_9_2/HEPTools/include
    gfortran -O -fno-automatic -ffixed-line-length-132 -c improve_ps.f -I /mnt/e/mg5_amc_v2_9_2/HEPTools/include
    gfortran -O -fno-automatic -ffixed-line-length-132 -c born_matrix.f -I /mnt/e/mg5_amc_v2_9_2/HEPTools/include
    born_matrix.f:891:6:

      891 | TMP_JAMP(68) = AMP(135) + (1) * AMP(136) ! used 2 times
          | 1
    Error: Function ‘tmp_jamp’ at (1) has no IMPLICIT type
    born_matrix.f:892:6:

      892 | TMP_JAMP(67) = AMP(133) + (1) * AMP(134) ! used 2 times
          | 1
    Error: Function ‘tmp_jamp’ at (1) has no IMPLICIT type
    born_matrix.f:893:6:

      893 | TMP_JAMP(66) = AMP(131) + (1) * AMP(132) ! used 2 times
          | 1
    Error: Function ‘tmp_jamp’ at (1) has no IMPLICIT type
    born_matrix.f:894:6:

      894 | TMP_JAMP(65) = AMP(129) + (1) * AMP(130) ! used 2 times
          | 1
    Error: Function ‘tmp_jamp’ at (1) has no IMPLICIT type
    born_matrix.f:895:6:

      895 | TMP_JAMP(64) = AMP(127) + (1) * AMP(128) ! used 2 times
          | 1
    Error: Function ‘tmp_jamp’ at (1) has no IMPLICIT type
    born_matrix.f:896:6:

      896 | TMP_JAMP(63) = AMP(125) + (1) * AMP(126) ! used 2 times
          | 1
    Error: Function ‘tmp_jamp’ at (1) has no IMPLICIT type
    born_matrix.f:897:6:

      897 | TMP_JAMP(62) = AMP(123) + (1) * AMP(124) ! used 2 times
          | 1
    Error: Function ‘tmp_jamp’ at (1) has no IMPLICIT type
    born_matrix.f:898:6:

      898 | TMP_JAMP(61) = AMP(121) + (1) * AMP(122) ! used 2 times
          | 1
    Error: Function ‘tmp_jamp’ at (1) has no IMPLICIT type
    born_matrix.f:899:6:

      899 | TMP_JAMP(60) = AMP(119) + (1) * AMP(120) ! used 2 times
          | 1
    Error: Function ‘tmp_jamp’ at (1) has no IMPLICIT type
    born_matrix.f:900:6:

      900 | TMP_JAMP(59) = AMP(117) + (1) * AMP(118) ! used 2 times
          | 1
    Error: Function ‘tmp_jamp’ at (1) has no IMPLICIT type
    born_matrix.f:901:6:

      901 | TMP_JAMP(58) = AMP(115) + (1) * AMP(116) ! used 2 times
          | 1
    Error: Function ‘tmp_jamp’ at (1) has no IMPLICIT type
    born_matrix.f:902:6:

      902 | TMP_JAMP(57) = AMP(113) + (1) * AMP(114) ! used 2 times
          | 1
    Error: Function ‘tmp_jamp’ at (1) has no IMPLICIT type
    born_matrix.f:903:6:

      903 | TMP_JAMP(56) = AMP(111) + (1) * AMP(112) ! used 2 times
          | 1
    Error: Function ‘tmp_jamp’ at (1) has no IMPLICIT type
    born_matrix.f:904:6:

      904 | TMP_JAMP(55) = AMP(109) + (1) * AMP(110) ! used 2 times
          | 1
    Error: Function ‘tmp_jamp’ at (1) has no IMPLICIT type
    born_matrix.f:905:6:

      905 | TMP_JAMP(54) = AMP(107) + (1) * AMP(108) ! used 2 times
          | 1
    Error: Function ‘tmp_jamp’ at (1) has no IMPLICIT type
    born_matrix.f:906:6:

      906 | TMP_JAMP(53) = AMP(105) + (1) * AMP(106) ! used 2 times
          | 1
    Error: Function ‘tmp_jamp’ at (1) has no IMPLICIT type
    born_matrix.f:907:6:

      907 | TMP_JAMP(52) = AMP(103) + (1) * AMP(104) ! used 2 times
          | 1
    Error: Function ‘tmp_jamp’ at (1) has no IMPLICIT type
    born_matrix.f:908:6:

      908 | TMP_JAMP(51) = AMP(101) + (1) * AMP(102) ! used 2 times
          | 1
    Error: Function ‘tmp_jamp’ at (1) has no IMPLICIT type
    born_matrix.f:909:6:

      909 | TMP_JAMP(50) = AMP(99) + (1) * AMP(100) ! used 2 times
          | 1
    Error: Function ‘tmp_jamp’ at (1) has no IMPLICIT type
    born_matrix.f:910:6:

      910 | TMP_JAMP(49) = AMP(97) + (1) * AMP(98) ! used 2 times
          | 1
    Error: Function ‘tmp_jamp’ at (1) has no IMPLICIT type
    born_matrix.f:911:6:

      911 | TMP_JAMP(48) = AMP(95) + (1) * AMP(96) ! used 2 times
          | 1
    Error: Function ‘tmp_jamp’ at (1) has no IMPLICIT type
    born_matrix.f:912:6:

      912 | TMP_JAMP(47) = AMP(93) + (1) * AMP(94) ! used 2 times
          | 1
    Error: Function ‘tmp_jamp’ at (1) has no IMPLICIT type
    born_matrix.f:913:6:

      913 | TMP_JAMP(46) = AMP(91) + (1) * AMP(92) ! used 2 times
          | 1
    Error: Function ‘tmp_jamp’ at (1) has no IMPLICIT type
    born_matrix.f:914:6:

      914 | TMP_JAMP(45) = AMP(89) + (1) * AMP(90) ! used 2 times
          | 1
    Error: Function ‘tmp_jamp’ at (1) has no IMPLICIT type
    born_matrix.f:915:6:

      915 | TMP_JAMP(44) = AMP(87) + (1) * AMP(88) ! used 2 times
          | 1
    Error: Function ‘tmp_jamp’ at (1) has no IMPLICIT type
    born_matrix.f:916:6:

      916 | TMP_JAMP(43) = AMP(85) + (1) * AMP(86) ! used 2 times
          | 1
    Error: Function ‘tmp_jamp’ at (1) has no IMPLICIT type
    born_matrix.f:917:6:

      917 | TMP_JAMP(42) = AMP(83) + (1) * AMP(84) ! used 2 times
          | 1
    Error: Function ‘tmp_jamp’ at (1) has no IMPLICIT type
    born_matrix.f:918:6:

      918 | TMP_JAMP(41) = AMP(81) + (1) * AMP(82) ! used 2 times
          | 1
    Error: Function ‘tmp_jamp’ at (1) has no IMPLICIT type
    born_matrix.f:919:6:

      919 | TMP_JAMP(40) = AMP(79) + (1) * AMP(80) ! used 2 times
          | 1
    Error: Function ‘tmp_jamp’ at (1) has no IMPLICIT type
    born_matrix.f:920:6:

      920 | TMP_JAMP(39) = AMP(77) + (1) * AMP(78) ! used 2 times
          | 1
    Error: Function ‘tmp_jamp’ at (1) has no IMPLICIT type
    born_matrix.f:921:6:

      921 | TMP_JAMP(38) = AMP(75) + (1) * AMP(76) ! used 2 times
          | 1
    Error: Function ‘tmp_jamp’ at (1) has no IMPLICIT type
    born_matrix.f:922:6:

      922 | TMP_JAMP(37) = AMP(73) + (1) * AMP(74) ! used 2 times
          | 1
    Error: Function ‘tmp_jamp’ at (1) has no IMPLICIT type
    born_matrix.f:923:6:

      923 | TMP_JAMP(36) = AMP(71) + (1) * AMP(72) ! used 2 times
          | 1
    Error: Function ‘tmp_jamp’ at (1) has no IMPLICIT type
    born_matrix.f:924:6:

      924 | TMP_JAMP(35) = AMP(69) + (1) * AMP(70) ! used 2 times
          | 1
    Error: Function ‘tmp_jamp’ at (1) has no IMPLICIT type
    born_matrix.f:925:6:

      925 | TMP_JAMP(34) = AMP(67) + (1) * AMP(68) ! used 2 times
          | 1
    Error: Function ‘tmp_jamp’ at (1) has no IMPLICIT type
    born_matrix.f:926:6:

      926 | TMP_JAMP(33) = AMP(65) + (1) * AMP(66) ! used 2 times
          | 1
    Error: Function ‘tmp_jamp’ at (1) has no IMPLICIT type
    born_matrix.f:927:6:

      927 | TMP_JAMP(32) = AMP(63) + (1) * AMP(64) ! used 2 times
          | 1
    Error: Function ‘tmp_jamp’ at (1) has no IMPLICIT type
    born_matrix.f:928:6:

      928 | TMP_JAMP(31) = AMP(61) + (1) * AMP(62) ! used 2 times
          | 1
    Error: Function ‘tmp_jamp’ at (1) has no IMPLICIT type
    born_matrix.f:929:6:

      929 | TMP_JAMP(30) = AMP(59) + (1) * AMP(60) ! used 2 times
          | 1
    Error: Function ‘tmp_jamp’ at (1) has no IMPLICIT type
    born_matrix.f:930:6:

      930 | TMP_JAMP(29) = AMP(57) + (1) * AMP(58) ! used 2 times
          | 1
    Error: Function ‘tmp_jamp’ at (1) has no IMPLICIT type
    born_matrix.f:931:6:

      931 | TMP_JAMP(28) = AMP(55) + (1) * AMP(56) ! used 2 times
          | 1
    Error: Function ‘tmp_jamp’ at (1) has no IMPLICIT type
    born_matrix.f:932:6:

      932 | TMP_JAMP(27) = AMP(53) + (1) * AMP(54) ! used 2 times
          | 1
    Error: Function ‘tmp_jamp’ at (1) has no IMPLICIT type
    born_matrix.f:933:6:

      933 | TMP_JAMP(26) = AMP(51) + (1) * AMP(52) ! used 2 times
          | 1
    Error: Function ‘tmp_jamp’ at (1) has no IMPLICIT type
    born_matrix.f:934:6:

      934 | TMP_JAMP(25) = AMP(49) + (1) * AMP(50) ! used 2 times
          | 1
    Error: Function ‘tmp_jamp’ at (1) has no IMPLICIT type
    born_matrix.f:935:6:

      935 | TMP_JAMP(24) = AMP(47) + (1) * AMP(48) ! used 2 times
          | 1
    Error: Function ‘tmp_jamp’ at (1) has no IMPLICIT type
    born_matrix.f:936:6:

      936 | TMP_JAMP(23) = AMP(45) + (1) * AMP(46) ! used 2 times
          | 1
    Error: Function ‘tmp_jamp’ at (1) has no IMPLICIT type
    born_matrix.f:937:6:

      937 | TMP_JAMP(22) = AMP(43) + (1) * AMP(44) ! used 2 times
          | 1
    Error: Function ‘tmp_jamp’ at (1) has no IMPLICIT type
    born_matrix.f:938:6:

      938 | TMP_JAMP(21) = AMP(41) + (1) * AMP(42) ! used 2 times
          | 1
    Error: Function ‘tmp_jamp’ at (1) has no IMPLICIT type
    born_matrix.f:939:6:

      939 | TMP_JAMP(20) = AMP(39) + (1) * AMP(40) ! used 2 times
          | 1
    Error: Function ‘tmp_jamp’ at (1) has no IMPLICIT type
    born_matrix.f:940:6:

      940 | TMP_JAMP(19) = AMP(37) + (1) * AMP(38) ! used 2 times
          | 1
    Error: Function ‘tmp_jamp’ at (1) has no IMPLICIT type
    born_matrix.f:941:6:

      941 | TMP_JAMP(18) = AMP(35) + (1) * AMP(36) ! used 2 times
          | 1
    Error: Function ‘tmp_jamp’ at (1) has no IMPLICIT type
    born_matrix.f:942:6:

      942 | TMP_JAMP(17) = AMP(33) + (1) * AMP(34) ! used 2 times
          | 1
    Error: Function ‘tmp_jamp’ at (1) has no IMPLICIT type
    born_matrix.f:943:6:

      943 | TMP_JAMP(16) = AMP(30) + (1) * AMP(31) ! used 2 times
          | 1
    Error: Function ‘tmp_jamp’ at (1) has no IMPLICIT type
    born_matrix.f:944:6:

      944 | TMP_JAMP(15) = AMP(29) + (1) * AMP(32) ! used 2 times
          | 1
    Error: Function ‘tmp_jamp’ at (1) has no IMPLICIT type
    born_matrix.f:945:6:

      945 | TMP_JAMP(14) = AMP(26) + (1) * AMP(27) ! used 2 times
          | 1
    Error: Function ‘tmp_jamp’ at (1) has no IMPLICIT type
    born_matrix.f:946:6:

      946 | TMP_JAMP(13) = AMP(25) + (1) * AMP(28) ! used 2 times
          | 1
    Error: Function ‘tmp_jamp’ at (1) has no IMPLICIT type
    born_matrix.f:947:6:

      947 | TMP_JAMP(12) = AMP(22) + (1) * AMP(23) ! used 2 times
          | 1
    Error: Function ‘tmp_jamp’ at (1) has no IMPLICIT type
    born_matrix.f:948:6:

      948 | TMP_JAMP(11) = AMP(21) + (1) * AMP(24) ! used 2 times
          | 1
    Error: Function ‘tmp_jamp’ at (1) has no IMPLICIT type
    born_matrix.f:949:6:

      949 | TMP_JAMP(10) = AMP(18) + (1) * AMP(19) ! used 2 times
          | 1
    Error: Function ‘tmp_jamp’ at (1) has no IMPLICIT type
    born_matrix.f:950:6:

      950 | TMP_JAMP(9) = AMP(17) + (1) * AMP(20) ! used 2 times
          | 1
    Error: Function ‘tmp_jamp’ at (1) has no IMPLICIT type
    born_matrix.f:951:6:

      951 | TMP_JAMP(8) = AMP(14) + (1) * AMP(15) ! used 2 times
          | 1
    Error: Function ‘tmp_jamp’ at (1) has no IMPLICIT type
    born_matrix.f:952:6:

      952 | TMP_JAMP(7) = AMP(13) + (1) * AMP(16) ! used 2 times
          | 1
    Error: Function ‘tmp_jamp’ at (1) has no IMPLICIT type
    born_matrix.f:953:6:

      953 | TMP_JAMP(6) = AMP(10) + (1) * AMP(11) ! used 2 times
          | 1
    Error: Function ‘tmp_jamp’ at (1) has no IMPLICIT type
    born_matrix.f:954:6:

      954 | TMP_JAMP(5) = AMP(9) + (1) * AMP(12) ! used 2 times
          | 1
    Error: Function ‘tmp_jamp’ at (1) has no IMPLICIT type
    born_matrix.f:955:6:

      955 | TMP_JAMP(4) = AMP(6) + (1) * AMP(7) ! used 2 times
          | 1
    Error: Function ‘tmp_jamp’ at (1) has no IMPLICIT type
    born_matrix.f:956:6:

      956 | TMP_JAMP(3) = AMP(5) + (1) * AMP(8) ! used 2 times
          | 1
    Error: Function ‘tmp_jamp’ at (1) has no IMPLICIT type
    born_matrix.f:957:6:

      957 | TMP_JAMP(2) = AMP(2) + (1) * AMP(3) ! used 2 times
          | 1
    Error: Function ‘tmp_jamp’ at (1) has no IMPLICIT type
    born_matrix.f:958:6:

      958 | TMP_JAMP(1) = AMP(1) + (1) * AMP(4) ! used 2 times
          | 1
    Error: Function ‘tmp_jamp’ at (1) has no IMPLICIT type
    born_matrix.f:959:6:

      959 | TMP_JAMP(102) = TMP_JAMP(3) + (1) * TMP_JAMP(2) ! used 2 times
          | 1
    Error: Function ‘tmp_jamp’ at (1) has no IMPLICIT type
    born_matrix.f:959:50:

      959 | TMP_JAMP(102) = TMP_JAMP(3) + (1) * TMP_JAMP(2) ! used 2 times
          | 1
    Error: Function ‘tmp_jamp’ at (1) has no IMPLICIT type
    born_matrix.f:960:6:

      960 | TMP_JAMP(101) = TMP_JAMP(4) + (1) * TMP_JAMP(1) ! used 2 times
          | 1
    Error: Function ‘tmp_jamp’ at (1) has no IMPLICIT type
    born_matrix.f:960:50:

      960 | TMP_JAMP(101) = TMP_JAMP(4) + (1) * TMP_JAMP(1) ! used 2 times
          | 1
    Error: Function ‘tmp_jamp’ at (1) has no IMPLICIT type
    born_matrix.f:961:6:

      961 | TMP_JAMP(100) = TMP_JAMP(7) + (1) * TMP_JAMP(6) ! used 2 times
          | 1
    Error: Function ‘tmp_jamp’ at (1) has no IMPLICIT type
    born_matrix.f:961:50:

      961 | TMP_JAMP(100) = TMP_JAMP(7) + (1) * TMP_JAMP(6) ! used 2 times
          | 1
    Error: Function ‘tmp_jamp’ at (1) has no IMPLICIT type
    born_matrix.f:962:6:

      962 | TMP_JAMP(99) = TMP_JAMP(8) + (1) * TMP_JAMP(5) ! used 2 times
          | 1
    Error: Function ‘tmp_jamp’ at (1) has no IMPLICIT type
    born_matrix.f:962:49:

      962 | TMP_JAMP(99) = TMP_JAMP(8) + (1) * TMP_JAMP(5) ! used 2 times
          | 1
    Error: Function ‘tmp_jamp’ at (1) has no IMPLICIT type
    born_matrix.f:963:6:

      963 | TMP_JAMP(98) = TMP_JAMP(11) + (1) * TMP_JAMP(10) ! used 2 times
          | 1
    Error: Function ‘tmp_jamp’ at (1) has no IMPLICIT type
    born_matrix.f:963:50:

      963 | TMP_JAMP(98) = TMP_JAMP(11) + (1) * TMP_JAMP(10) ! used 2 times
          | 1
    Error: Function ‘tmp_jamp’ at (1) has no IMPLICIT type
    born_matrix.f:964:6:

      964 | TMP_JAMP(97) = TMP_JAMP(12) + (1) * TMP_JAMP(9) ! used 2 times
          | 1
    Error: Function ‘tmp_jamp’ at (1) has no IMPLICIT type
    born_matrix.f:964:50:

      964 | TMP_JAMP(97) = TMP_JAMP(12) + (1) * TMP_JAMP(9) ! used 2 times
          | 1
    Error: Function ‘tmp_jamp’ at (1) has no IMPLICIT type
    born_matrix.f:965:6:

      965 | TMP_JAMP(96) = TMP_JAMP(15) + (1) * TMP_JAMP(14) ! used 2 times
          | 1
    Error: Function ‘tmp_jamp’ at (1) has no IMPLICIT type
    born_matrix.f:965:50:

      965 | TMP_JAMP(96) = TMP_JAMP(15) + (1) * TMP_JAMP(14) ! used 2 times
          | 1
    Error: Function ‘tmp_jamp’ at (1) has no IMPLICIT type
    born_matrix.f:966:6:

      966 | TMP_JAMP(95) = TMP_JAMP(16) + (1) * TMP_JAMP(13) ! used 2 times
          | 1
    Error: Function ‘tmp_jamp’ at (1) has no IMPLICIT type
    born_matrix.f:966:50:

      966 | TMP_JAMP(95) = TMP_JAMP(16) + (1) * TMP_JAMP(13) ! used 2 times
          | 1
    Error: Function ‘tmp_jamp’ at (1) has no IMPLICIT type
    born_matrix.f:967:6:

      967 | TMP_JAMP(94) = TMP_JAMP(18) + (1) * TMP_JAMP(17) ! used 2 times
          | 1
    Error: Function ‘tmp_jamp’ at (1) has no IMPLICIT type
    born_matrix.f:967:50:

      967 | TMP_JAMP(94) = TMP_JAMP(18) + (1) * TMP_JAMP(17) ! used 2 times
          | 1
    Error: Function ‘tmp_jamp’ at (1) has no IMPLICIT type
    born_matrix.f:968:6:

      968 | TMP_JAMP(93) = TMP_JAMP(20) + (1) * TMP_JAMP(19) ! used 2 times
          | 1
    Error: Function ‘tmp_jamp’ at (1) has no IMPLICIT type
    born_matrix.f:968:50:

      968 | TMP_JAMP(93) = TMP_JAMP(20) + (1) * TMP_JAMP(19) ! used 2 times
          | 1
    Error: Function ‘tmp_jamp’ at (1) has no IMPLICIT type
    born_matrix.f:969:6:

      969 | TMP_JAMP(92) = TMP_JAMP(22) + (1) * TMP_JAMP(21) ! used 2 times
          | 1
    Error: Function ‘tmp_jamp’ at (1) has no IMPLICIT type
    born_matrix.f:969:50:

      969 | TMP_JAMP(92) = TMP_JAMP(22) + (1) * TMP_JAMP(21) ! used 2 times
          | 1
    Error: Function ‘tmp_jamp’ at (1) has no IMPLICIT type
    born_matrix.f:970:6:

      970 | TMP_JAMP(91) = TMP_JAMP(25) + (1) * TMP_JAMP(24) ! used 2 times
          | 1
    Error: Function ‘tmp_jamp’ at (1) has no IMPLICIT type
    born_matrix.f:970:50:

      970 | TMP_JAMP(91) = TMP_JAMP(25) + (1) * TMP_JAMP(24) ! used 2 times
          | 1
    Error: Function ‘tmp_jamp’ at (1) has no IMPLICIT type
    born_matrix.f:971:6:

      971 | TMP_JAMP(90) = TMP_JAMP(27) + (1) * TMP_JAMP(26) ! used 2 times
          | 1
    Error: Function ‘tmp_jamp’ at (1) has no IMPLICIT type
    born_matrix.f:971:50:

      971 | TMP_JAMP(90) = TMP_JAMP(27) + (1) * TMP_JAMP(26) ! used 2 times
          | 1
    Error: Function ‘tmp_jamp’ at (1) has no IMPLICIT type
    born_matrix.f:972:6:

      972 | TMP_JAMP(89) = TMP_JAMP(29) + (1) * TMP_JAMP(28) ! used 2 times
          | 1
    Error: Function ‘tmp_jamp’ at (1) has no IMPLICIT type
    born_matrix.f:972:50:

      972 | TMP_JAMP(89) = TMP_JAMP(29) + (1) * TMP_JAMP(28) ! used 2 times
          | 1
    Error: Function ‘tmp_jamp’ at (1) has no IMPLICIT type
    born_matrix.f:973:6:

      973 | TMP_JAMP(88) = TMP_JAMP(31) + (1) * TMP_JAMP(30) ! used 2 times
          | 1
    Error: Function ‘tmp_jamp’ at (1) has no IMPLICIT type
    born_matrix.f:973:50:

      973 | TMP_JAMP(88) = TMP_JAMP(31) + (1) * TMP_JAMP(30) ! used 2 times
          | 1
    Error: Function ‘tmp_jamp’ at (1) has no IMPLICIT type
    born_matrix.f:974:6:

      974 | TMP_JAMP(87) = TMP_JAMP(33) + (1) * TMP_JAMP(32) ! used 2 times
          | 1
    Error: Function ‘tmp_jamp’ at (1) has no IMPLICIT type
    born_matrix.f:974:50:

      974 | TMP_JAMP(87) = TMP_JAMP(33) + (1) * TMP_JAMP(32) ! used 2 times
          | 1
    Error: Function ‘tmp_jamp’ at (1) has no IMPLICIT type
    born_matrix.f:975:6:

      975 | TMP_JAMP(86) = TMP_JAMP(35) + (1) * TMP_JAMP(34) ! used 2 times
          | 1
    Error: Function ‘tmp_jamp’ at (1) has no IMPLICIT type
    born_matrix.f:975:50:

      975 | TMP_JAMP(86) = TMP_JAMP(35) + (1) * TMP_JAMP(34) ! used 2 times
          | 1
    Error: Function ‘tmp_jamp’ at (1) has no IMPLICIT type
    born_matrix.f:976:6:

      976 | TMP_JAMP(85) = TMP_JAMP(37) + (1) * TMP_JAMP(36) ! used 2 times
          | 1
    Error: Function ‘tmp_jamp’ at (1) has no IMPLICIT type
    born_matrix.f:976:50:

      976 | TMP_JAMP(85) = TMP_JAMP(37) + (1) * TMP_JAMP(36) ! used 2 times
          | 1
    Error: Function ‘tmp_jamp’ at (1) has no IMPLICIT type
    born_matrix.f:977:6:

      977 | TMP_JAMP(84) = TMP_JAMP(38) + (1) * TMP_JAMP(23) ! used 2 times
          | 1
    Error: Function ‘tmp_jamp’ at (1) has no IMPLICIT type
    born_matrix.f:977:50:

      977 | TMP_JAMP(84) = TMP_JAMP(38) + (1) * TMP_JAMP(23) ! used 2 times
          | 1
    Error: Function ‘tmp_jamp’ at (1) has no IMPLICIT type
    born_matrix.f:978:6:

      978 | TMP_JAMP(83) = TMP_JAMP(40) + (1) * TMP_JAMP(39) ! used 2 times
          | 1
    Error: Function ‘tmp_jamp’ at (1) has no IMPLICIT type
    born_matrix.f:978:50:

      978 | TMP_JAMP(83) = TMP_JAMP(40) + (1) * TMP_JAMP(39) ! used 2 times
          | 1
    Error: Function ‘tmp_jamp’ at (1) has no IMPLICIT type
    born_matrix.f:979:6:

      979 | TMP_JAMP(82) = TMP_JAMP(42) + (1) * TMP_JAMP(41) ! used 2 times
          | 1
    Error: Function ‘tmp_jamp’ at (1) has no IMPLICIT type
    born_matrix.f:979:50:

      979 | TMP_JAMP(82) = TMP_JAMP(42) + (1) * TMP_JAMP(41) ! used 2 times
          | 1
    Error: Function ‘tmp_jamp’ at (1) has no IMPLICIT type
    born_matrix.f:980:6:

      980 | TMP_JAMP(81) = TMP_JAMP(44) + (1) * TMP_JAMP(43) ! used 2 times
          | 1
    Error: Function ‘tmp_jamp’ at (1) has no IMPLICIT type
    born_matrix.f:980:50:

      980 | TMP_JAMP(81) = TMP_JAMP(44) + (1) * TMP_JAMP(43) ! used 2 times
          | 1
    Error: Function ‘tmp_jamp’ at (1) has no IMPLICIT type
    born_matrix.f:981:6:

      981 | TMP_JAMP(80) = TMP_JAMP(46) + (1) * TMP_JAMP(45) ! used 2 times
          | 1
    Error: Function ‘tmp_jamp’ at (1) has no IMPLICIT type
    born_matrix.f:981:50:

      981 | TMP_JAMP(80) = TMP_JAMP(46) + (1) * TMP_JAMP(45) ! used 2 times
          | 1
    Error: Function ‘tmp_jamp’ at (1) has no IMPLICIT type
    born_matrix.f:982:6:

      982 | TMP_JAMP(79) = TMP_JAMP(48) + (1) * TMP_JAMP(47) ! used 2 times
          | 1
    Error: Function ‘tmp_jamp’ at (1) has no IMPLICIT type
    born_matrix.f:982:50:

      982 | TMP_JAMP(79) = TMP_JAMP(48) + (1) * TMP_JAMP(47) ! used 2 times
          | 1
    Error: Function ‘tmp_jamp’ at (1) has no IMPLICIT type
    born_matrix.f:983:6:

      983 | TMP_JAMP(78) = TMP_JAMP(50) + (1) * TMP_JAMP(49) ! used 2 times
          | 1
    Error: Function ‘tmp_jamp’ at (1) has no IMPLICIT type
    born_matrix.f:983:50:

      983 | TMP_JAMP(78) = TMP_JAMP(50) + (1) * TMP_JAMP(49) ! used 2 times
          | 1
    Error: Function ‘tmp_jamp’ at (1) has no IMPLICIT type
    born_matrix.f:984:6:

      984 | TMP_JAMP(77) = TMP_JAMP(52) + (1) * TMP_JAMP(51) ! used 2 times
          | 1
    Error: Function ‘tmp_jamp’ at (1) has no IMPLICIT type
    born_matrix.f:984:50:

      984 | TMP_JAMP(77) = TMP_JAMP(52) + (1) * TMP_JAMP(51) ! used 2 times
          | 1
    Error: Function ‘tmp_jamp’ at (1) has no IMPLICIT type
    born_matrix.f:985:6:

      985 | TMP_JAMP(76) = TMP_JAMP(54) + (1) * TMP_JAMP(53) ! used 2 times
          | 1
    Error: Function ‘tmp_jamp’ at (1) has no IMPLICIT type
    born_matrix.f:985:50:

      985 | TMP_JAMP(76) = TMP_JAMP(54) + (1) * TMP_JAMP(53) ! used 2 times
          | 1
    Error: Function ‘tmp_jamp’ at (1) has no IMPLICIT type
    born_matrix.f:986:6:

      986 | TMP_JAMP(75) = TMP_JAMP(56) + (1) * TMP_JAMP(55) ! used 2 times
          | 1
    Error: Function ‘tmp_jamp’ at (1) has no IMPLICIT type
    born_matrix.f:986:50:

      986 | TMP_JAMP(75) = TMP_JAMP(56) + (1) * TMP_JAMP(55) ! used 2 times
          | 1
    Error: Function ‘tmp_jamp’ at (1) has no IMPLICIT type
    born_matrix.f:987:6:

      987 | TMP_JAMP(74) = TMP_JAMP(58) + (1) * TMP_JAMP(57) ! used 2 times
          | 1
    Error: Function ‘tmp_jamp’ at (1) has no IMPLICIT type
    born_matrix.f:987:50:

      987 | TMP_JAMP(74) = TMP_JAMP(58) + (1) * TMP_JAMP(57) ! used 2 times
          | 1
    Error: Function ‘tmp_jamp’ at (1) has no IMPLICIT type
    born_matrix.f:988:6:

      988 | TMP_JAMP(73) = TMP_JAMP(60) + (1) * TMP_JAMP(59) ! used 2 times
          | 1
    Error: Function ‘tmp_jamp’ at (1) has no IMPLICIT type
    born_matrix.f:988:50:

      988 | TMP_JAMP(73) = TMP_JAMP(60) + (1) * TMP_JAMP(59) ! used 2 times
          | 1
    Error: Function ‘tmp_jamp’ at (1) has no IMPLICIT type
    born_matrix.f:989:6:

      989 | TMP_JAMP(72) = TMP_JAMP(62) + (1) * TMP_JAMP(61) ! used 2 times
          | 1
    Error: Function ‘tmp_jamp’ at (1) has no IMPLICIT type
    born_matrix.f:989:50:

      989 | TMP_JAMP(72) = TMP_JAMP(62) + (1) * TMP_JAMP(61) ! used 2 times
          | 1
    Error: Function ‘tmp_jamp’ at (1) has no IMPLICIT type
    born_matrix.f:990:6:

      990 | TMP_JAMP(71) = TMP_JAMP(64) + (1) * TMP_JAMP(63) ! used 2 times
          | 1
    Error: Function ‘tmp_jamp’ at (1) has no IMPLICIT type
    born_matrix.f:990:50:

      990 | TMP_JAMP(71) = TMP_JAMP(64) + (1) * TMP_JAMP(63) ! used 2 times
          | 1
    Error: Function ‘tmp_jamp’ at (1) has no IMPLICIT type
    born_matrix.f:991:6:

      991 | TMP_JAMP(70) = TMP_JAMP(66) + (1) * TMP_JAMP(65) ! used 2 times
          | 1
    Error: Function ‘tmp_jamp’ at (1) has no IMPLICIT type
    born_matrix.f:991:50:

      991 | TMP_JAMP(70) = TMP_JAMP(66) + (1) * TMP_JAMP(65) ! used 2 times
          | 1
    Error: Function ‘tmp_jamp’ at (1) has no IMPLICIT type
    born_matrix.f:992:6:

      992 | TMP_JAMP(69) = TMP_JAMP(68) + (1) * TMP_JAMP(67) ! used 2 times
          | 1
    Error: Function ‘tmp_jamp’ at (1) has no IMPLICIT type
    born_matrix.f:992:50:

      992 | TMP_JAMP(69) = TMP_JAMP(68) + (1) * TMP_JAMP(67) ! used 2 times
          | 1
    Error: Function ‘tmp_jamp’ at (1) has no IMPLICIT type
    born_matrix.f:993:6:

      993 | TMP_JAMP(118) = TMP_JAMP(73) + (1) * TMP_JAMP(72) ! used 2 times
          | 1
    Error: Function ‘tmp_jamp’ at (1) has no IMPLICIT type
    born_matrix.f:993:51:

      993 | TMP_JAMP(118) = TMP_JAMP(73) + (1) * TMP_JAMP(72) ! used 2 times
          | 1
    Error: Function ‘tmp_jamp’ at (1) has no IMPLICIT type
    born_matrix.f:994:6:

      994 | TMP_JAMP(117) = TMP_JAMP(75) + (1) * TMP_JAMP(70) ! used 2 times
          | 1
    Error: Function ‘tmp_jamp’ at (1) has no IMPLICIT type
    born_matrix.f:994:51:

      994 | TMP_JAMP(117) = TMP_JAMP(75) + (1) * TMP_JAMP(70) ! used 2 times
          | 1
    Error: Function ‘tmp_jamp’ at (1) has no IMPLICIT type
    born_matrix.f:995:6:

      995 | TMP_JAMP(116) = TMP_JAMP(77) + (1) * TMP_JAMP(76) ! used 2 times
          | 1
    Error: Function ‘tmp_jamp’ at (1) has no IMPLICIT type
    born_matrix.f:995:51:

      995 | TMP_JAMP(116) = TMP_JAMP(77) + (1) * TMP_JAMP(76) ! used 2 times
          | 1
    Error: Function ‘tmp_jamp’ at (1) has no IMPLICIT type
    born_matrix.f:996:6:

      996 | TMP_JAMP(115) = TMP_JAMP(78) + (1) * TMP_JAMP(74) ! used 2 times
          | 1
    Error: Function ‘tmp_jamp’ at (1) has no IMPLICIT type
    born_matrix.f:996:51:

      996 | TMP_JAMP(115) = TMP_JAMP(78) + (1) * TMP_JAMP(74) ! used 2 times
          | 1
    Error: Function ‘tmp_jamp’ at (1) has no IMPLICIT type
    born_matrix.f:997:6:

      997 | TMP_JAMP(114) = TMP_JAMP(81) + (1) * TMP_JAMP(80) ! used 2 times
          | 1
    Error: Function ‘tmp_jamp’ at (1) has no IMPLICIT type
    born_matrix.f:997:51:

      997 | TMP_JAMP(114) = TMP_JAMP(81) + (1) * TMP_JAMP(80) ! used 2 times
          | 1
    Error: Function ‘tmp_jamp’ at (1) has no IMPLICIT type
    born_matrix.f:998:6:

      998 | TMP_JAMP(113) = TMP_JAMP(83) + (1) * TMP_JAMP(82) ! used 2 times
          | 1
    Error: Function ‘tmp_jamp’ at (1) has no IMPLICIT type
    born_matrix.f:998:51:

      998 | TMP_JAMP(113) = TMP_JAMP(83) + (1) * TMP_JAMP(82) ! used 2 times
          | 1
    Error: Function ‘tmp_jamp’ at (1) has no IMPLICIT type
    born_matrix.f:999:6:

      999 | TMP_JAMP(112) = TMP_JAMP(85) + (1) * TMP_JAMP(79) ! used 2 times
          | 1
    Error: Function ‘tmp_jamp’ at (1) has no IMPLICIT type
    born_matrix.f:999:51:

      999 | TMP_JAMP(112) = TMP_JAMP(85) + (1) * TMP_JAMP(79) ! used 2 times
          | 1
    Error: Function ‘tmp_jamp’ at (1) has no IMPLICIT type
    born_matrix.f:1000:6:

     1000 | TMP_JAMP(111) = TMP_JAMP(87) + (1) * TMP_JAMP(86) ! used 2 times
          | 1
    Error: Function ‘tmp_jamp’ at (1) has no IMPLICIT type
    born_matrix.f:1000:51:

     1000 | TMP_JAMP(111) = TMP_JAMP(87) + (1) * TMP_JAMP(86) ! used 2 times
          | 1
    Error: Function ‘tmp_jamp’ at (1) has no IMPLICIT type
    born_matrix.f:1001:6:

     1001 | TMP_JAMP(110) = TMP_JAMP(89) + (1) * TMP_JAMP(88) ! used 2 times
          | 1
    Error: Function ‘tmp_jamp’ at (1) has no IMPLICIT type
    born_matrix.f:1001:51:

     1001 | TMP_JAMP(110) = TMP_JAMP(89) + (1) * TMP_JAMP(88) ! used 2 times
          | 1
    Error: Function ‘tmp_jamp’ at (1) has no IMPLICIT type
    born_matrix.f:1002:6:

     1002 | TMP_JAMP(109) = TMP_JAMP(91) + (1) * TMP_JAMP(90) ! used 2 times
          | 1
    Error: Function ‘tmp_jamp’ at (1) has no IMPLICIT type
    born_matrix.f:1002:51:

     1002 | TMP_JAMP(109) = TMP_JAMP(91) + (1) * TMP_JAMP(90) ! used 2 times
          | 1
    Error: Function ‘tmp_jamp’ at (1) has no IMPLICIT type
    born_matrix.f:1003:6:

     1003 | TMP_JAMP(108) = TMP_JAMP(92) + (1) * TMP_JAMP(84) ! used 2 times
          | 1
    Error: Function ‘tmp_jamp’ at (1) has no IMPLICIT type
    born_matrix.f:1003:51:

     1003 | TMP_JAMP(108) = TMP_JAMP(92) + (1) * TMP_JAMP(84) ! used 2 times
          | 1
    Error: Function ‘tmp_jamp’ at (1) has no IMPLICIT type
    born_matrix.f:1004:6:

     1004 | TMP_JAMP(107) = TMP_JAMP(94) + (1) * TMP_JAMP(93) ! used 2 times
          | 1
    Error: Function ‘tmp_jamp’ at (1) has no IMPLICIT type
    born_matrix.f:1004:51:

     1004 | TMP_JAMP(107) = TMP_JAMP(94) + (1) * TMP_JAMP(93) ! used 2 times
          | 1
    Error: Function ‘tmp_jamp’ at (1) has no IMPLICIT type
    born_matrix.f:1005:6:

     1005 | TMP_JAMP(106) = TMP_JAMP(97) + (1) * TMP_JAMP(96) ! used 2 times
          | 1
    Error: Function ‘tmp_jamp’ at (1) has no IMPLICIT type
    born_matrix.f:1005:51:

     1005 | TMP_JAMP(106) = TMP_JAMP(97) + (1) * TMP_JAMP(96) ! used 2 times
          | 1
    Error: Function ‘tmp_jamp’ at (1) has no IMPLICIT type
    born_matrix.f:1006:6:

     1006 | TMP_JAMP(105) = TMP_JAMP(98) + (1) * TMP_JAMP(95) ! used 2 times
          | 1
    Error: Function ‘tmp_jamp’ at (1) has no IMPLICIT type
    born_matrix.f:1006:51:

     1006 | TMP_JAMP(105) = TMP_JAMP(98) + (1) * TMP_JAMP(95) ! used 2 times
          | 1
    Error: Function ‘tmp_jamp’ at (1) has no IMPLICIT type
    born_matrix.f:1007:6:

     1007 | TMP_JAMP(104) = TMP_JAMP(101) + (1) * TMP_JAMP(100) ! used 2 times
          | 1
    Error: Function ‘tmp_jamp’ at (1) has no IMPLICIT type
    born_matrix.f:1007:52:

     1007 | TMP_JAMP(104) = TMP_JAMP(101) + (1) * TMP_JAMP(100) ! used 2 times
          | 1
    Error: Function ‘tmp_jamp’ at (1) has no IMPLICIT type
    born_matrix.f:1008:6:

     1008 | TMP_JAMP(103) = TMP_JAMP(102) + (1) * TMP_JAMP(99) ! used 2 times
          | 1
    Error: Function ‘tmp_jamp’ at (1) has no IMPLICIT type
    born_matrix.f:1008:52:

     1008 | TMP_JAMP(103) = TMP_JAMP(102) + (1) * TMP_JAMP(99) ! used 2 times
          | 1
    Error: Function ‘tmp_jamp’ at (1) has no IMPLICIT type
    born_matrix.f:1009:6:

     1009 | TMP_JAMP(126) = TMP_JAMP(105) + (1) * TMP_JAMP(103) ! used 2 times
          | 1
    Error: Function ‘tmp_jamp’ at (1) has no IMPLICIT type
    born_matrix.f:1009:52:

     1009 | TMP_JAMP(126) = TMP_JAMP(105) + (1) * TMP_JAMP(103) ! used 2 times
          | 1
    Error: Function ‘tmp_jamp’ at (1) has no IMPLICIT type
    born_matrix.f:1010:6:

     1010 | TMP_JAMP(125) = TMP_JAMP(106) + (1) * TMP_JAMP(104) ! used 2 times
          | 1
    Error: Function ‘tmp_jamp’ at (1) has no IMPLICIT type
    born_matrix.f:1010:52:

     1010 | TMP_JAMP(125) = TMP_JAMP(106) + (1) * TMP_JAMP(104) ! used 2 times
          | 1
    Error: Function ‘tmp_jamp’ at (1) has no IMPLICIT type
    born_matrix.f:1011:6:

     1011 | TMP_JAMP(124) = TMP_JAMP(108) + (1) * TMP_JAMP(107) ! used 2 times
          | 1
    Error: Function ‘tmp_jamp’ at (1) has no IMPLICIT type
    born_matrix.f:1011:52:

     1011 | TMP_JAMP(124) = TMP_JAMP(108) + (1) * TMP_JAMP(107) ! used 2 times
          | 1
    Error: Function ‘tmp_jamp’ at (1) has no IMPLICIT type
    born_matrix.f:1012:6:

     1012 | TMP_JAMP(123) = TMP_JAMP(110) + (1) * TMP_JAMP(109) ! used 2 times
          | 1
    Error: Function ‘tmp_jamp’ at (1) has no IMPLICIT type
    born_matrix.f:1012:52:

     1012 | TMP_JAMP(123) = TMP_JAMP(110) + (1) * TMP_JAMP(109) ! used 2 times
          | 1
    Error: Function ‘tmp_jamp’ at (1) has no IMPLICIT type
    born_matrix.f:1013:6:

     1013 | TMP_JAMP(122) = TMP_JAMP(112) + (1) * TMP_JAMP(111) ! used 2 times
          | 1
    Error: Function ‘tmp_jamp’ at (1) has no IMPLICIT type
    born_matrix.f:1013:52:

     1013 | TMP_JAMP(122) = TMP_JAMP(112) + (1) * TMP_JAMP(111) ! used 2 times
          | 1
    Error: Function ‘tmp_jamp’ at (1) has no IMPLICIT type
    born_matrix.f:1014:6:

     1014 | TMP_JAMP(121) = TMP_JAMP(114) + (1) * TMP_JAMP(113) ! used 2 times
          | 1
    Error: Function ‘tmp_jamp’ at (1) has no IMPLICIT type
    born_matrix.f:1014:52:

     1014 | TMP_JAMP(121) = TMP_JAMP(114) + (1) * TMP_JAMP(113) ! used 2 times
          | 1
    Error: Function ‘tmp_jamp’ at (1) has no IMPLICIT type
    born_matrix.f:1015:6:

     1015 | TMP_JAMP(120) = TMP_JAMP(117) + (1) * TMP_JAMP(116) ! used 2 times
          | 1
    Error: Function ‘tmp_jamp’ at (1) has no IMPLICIT type
    born_matrix.f:1015:52:

     1015 | TMP_JAMP(120) = TMP_JAMP(117) + (1) * TMP_JAMP(116) ! used 2 times
          | 1
    Error: Function ‘tmp_jamp’ at (1) has no IMPLICIT type
    born_matrix.f:1016:6:

     1016 | TMP_JAMP(119) = TMP_JAMP(118) + (1) * TMP_JAMP(115) ! used 2 times
          | 1
    Error: Function ‘tmp_jamp’ at (1) has no IMPLICIT type
    born_matrix.f:1016:52:

     1016 | TMP_JAMP(119) = TMP_JAMP(118) + (1) * TMP_JAMP(115) ! used 2 times
          | 1
    Error: Function ‘tmp_jamp’ at (1) has no IMPLICIT type
    born_matrix.f:1017:6:

     1017 | TMP_JAMP(130) = TMP_JAMP(121) + (1) * TMP_JAMP(120) ! used 2 times
          | 1
    Error: Function ‘tmp_jamp’ at (1) has no IMPLICIT type
    born_matrix.f:1017:52:

     1017 | TMP_JAMP(130) = TMP_JAMP(121) + (1) * TMP_JAMP(120) ! used 2 times
          | 1
    Error: Function ‘tmp_jamp’ at (1) has no IMPLICIT type
    born_matrix.f:1018:6:

     1018 | TMP_JAMP(129) = TMP_JAMP(122) + (1) * TMP_JAMP(119) ! used 2 times
          | 1
    Error: Function ‘tmp_jamp’ at (1) has no IMPLICIT type
    born_matrix.f:1018:52:

     1018 | TMP_JAMP(129) = TMP_JAMP(122) + (1) * TMP_JAMP(119) ! used 2 times
          | 1
    Error: Function ‘tmp_jamp’ at (1) has no IMPLICIT type
    born_matrix.f:1019:6:

     1019 | TMP_JAMP(128) = TMP_JAMP(125) + (1) * TMP_JAMP(124) ! used 2 times
          | 1
    Error: Function ‘tmp_jamp’ at (1) has no IMPLICIT type
    born_matrix.f:1019:52:

     1019 | TMP_JAMP(128) = TMP_JAMP(125) + (1) * TMP_JAMP(124) ! used 2 times
          | 1
    Error: Function ‘tmp_jamp’ at (1) has no IMPLICIT type
    born_matrix.f:1020:6:

     1020 | TMP_JAMP(127) = TMP_JAMP(126) + (1) * TMP_JAMP(123) ! used 2 times
          | 1
    Error: Function ‘tmp_jamp’ at (1) has no IMPLICIT type
    born_matrix.f:1020:52:

     1020 | TMP_JAMP(127) = TMP_JAMP(126) + (1) * TMP_JAMP(123) ! used 2 times
          | 1
    Error: Function ‘tmp_jamp’ at (1) has no IMPLICIT type
    born_matrix.f:1021:6:

     1021 | TMP_JAMP(132) = TMP_JAMP(129) + (1) * TMP_JAMP(127) ! used 2 times
          | 1
    Error: Function ‘tmp_jamp’ at (1) has no IMPLICIT type
    born_matrix.f:1021:52:

     1021 | TMP_JAMP(132) = TMP_JAMP(129) + (1) * TMP_JAMP(127) ! used 2 times
          | 1
    Error: Function ‘tmp_jamp’ at (1) has no IMPLICIT type
    born_matrix.f:1022:6:

     1022 | TMP_JAMP(131) = TMP_JAMP(130) + (1) * TMP_JAMP(128) ! used 2 times
          | 1
    Error: Function ‘tmp_jamp’ at (1) has no IMPLICIT type
    born_matrix.f:1022:52:

     1022 | TMP_JAMP(131) = TMP_JAMP(130) + (1) * TMP_JAMP(128) ! used 2 times
          | 1
    Error: Function ‘tmp_jamp’ at (1) has no IMPLICIT type
    born_matrix.f:1023:6:

     1023 | TMP_JAMP(134) = TMP_JAMP(131) + (1) * TMP_JAMP(69) ! used 2 times
          | 1
    Error: Function ‘tmp_jamp’ at (1) has no IMPLICIT type
    born_matrix.f:1023:52:

     1023 | TMP_JAMP(134) = TMP_JAMP(131) + (1) * TMP_JAMP(69) ! used 2 times
          | 1
    Error: Function ‘tmp_jamp’ at (1) has no IMPLICIT type
    born_matrix.f:1024:6:

     1024 | TMP_JAMP(133) = TMP_JAMP(132) + (1) * TMP_JAMP(71) ! used 2 times
          | 1
    Error: Function ‘tmp_jamp’ at (1) has no IMPLICIT type
    born_matrix.f:1024:52:

     1024 | TMP_JAMP(133) = TMP_JAMP(132) + (1) * TMP_JAMP(71) ! used 2 times
          | 1
    Error: Function ‘tmp_jamp’ at (1) has no IMPLICIT type
    born_matrix.f:1025:60:

     1025 | JAMP(1,1) = (1D0/2D0)*TMP_JAMP(133)+(1D0/6D0)*TMP_JAMP(134)
          | 1
    Error: Function ‘tmp_jamp’ at (1) has no IMPLICIT type
    born_matrix.f:1026:62:

     1026 | JAMP(2,1) = (-1D0/6D0)*TMP_JAMP(133)+(-1D0/2D0)*TMP_JAMP(134)
          | 1
    Error: Function ‘tmp_jamp’ at (1) has no IMPLICIT type
    make[1]: *** [makefile:37: born_matrix.o] Error 1
    make[1]: Leaving directory '/mnt/e/mg5_amc_v2_9_2/ee4bnunu_qcd/SubProcesses/P0_epem_vmvmxbbbxbx/V0_epem_vmvmxbbbxbx'
    gfortran -o check_poles parton_lum_1.o parton_lum_chooser.o matrix_1.o real_me_chooser.o leshouche_inc_chooser.o fks_inc_chooser.o setcuts.o setscales.o born.o sborn_sf.o b_sf_003.o b_sf_005.o b_sf_007.o b_sf_006.o b_sf_004.o b_sf_009.o b_sf_002.o b_sf_010.o b_sf_001.o b_sf_008.o fks_Sij.o fastjetfortran_madfks_core.o fjcore.o fastjet_wrapper.o fks_singular.o veto_xsec.o montecarlocounter.o reweight_xsec.o boostwdir2.o configs_and_props_inc_chooser.o initcluster.o cluster.o reweight.o get_color.o FKSParamReader.o iproc_map.o MC_integer.o reweight_xsec_events_pdf_dummy.o appl_interface_dummy.o genps_fks.o weight_lines.o cuts.o pythia_unlops.o recluster.o check_poles.o BinothLHA.o born_hel.o -L../../lib/ libMadLoop.a -lcts -liregi -L/mnt/e/mg5_amc_v2_9_2/HEPTools/lib/ -lninja -L/mnt/e/mg5_amc_v2_9_2/HEPTools/lib/ -lavh_olo -L../../lib/ -ldhelas -lgeneric -lmodel -lpdf -lcernlib -lstdc++ -lstdc++
    gfortran: error: libMadLoop.a: No such file or directory
    make: *** [makefile:100: check_poles] Error 1

Please try to fix this compilations issue and retry.
Help might be found at https://answers.launchpad.net/mg5amcnlo.
If you think that this is a bug, you can report this at https://bugs.launchpad.net/mg5amcnlo
WARNING: fct <function compile_dir at 0x7f88c01d0430> does not return 0. Stopping the code in a clean way. The error was:
A compilation Error occurs when trying to compile /mnt/e/mg5_amc_v2_9_2/ee4bnunu_qcd/SubProcesses/P0_epem_vevexbbbxbx.
The compilation fails with the following output message:
    gfortran -O -fno-automatic -ffixed-line-length-132 -c -I. -I../../lib/ check_poles.f
    check_poles.f:305:132:

      305 | 101 Z(K)=Z(K-1)+PO2LOG-2.*LOG(DFLOAT(K-2))
          | 1
    Warning: Fortran 2018 deleted feature: DO termination statement which is not END DO or CONTINUE with label 101 at (1)
    check_poles.f:307:132:

      307 | 102 Z(K)=(Z(K)-LOG(DFLOAT(K-1)))
          | 1
    Warning: Fortran 2018 deleted feature: DO termination statement which is not END DO or CONTINUE with label 102 at (1)
    check_poles.f:319:132:

      319 | 105 XMT=XMT+ABS(XM(I))
          | 1
    Warning: Fortran 2018 deleted feature: DO termination statement which is not END DO or CONTINUE with label 105 at (1)
    check_poles.f:359:132:

      359 | 202 Q(1,I)=Q(4,I)*S*SIN(F)
          | 1
    Warning: Fortran 2018 deleted feature: DO termination statement which is not END DO or CONTINUE with label 202 at (1)
    check_poles.f:363:132:

      363 | 203 R(I)=0.
          | 1
    Warning: Fortran 2018 deleted feature: DO termination statement which is not END DO or CONTINUE with label 203 at (1)
    check_poles.f:365:132:

      365 | DO 204 K=1,4
          | 1
    Warning: Fortran 2018 deleted feature: Shared DO termination label 204 at (1)
    check_poles.f:366:132:

      366 | 204 R(K)=R(K)+Q(K,I)
          | 1
    Warning: Fortran 2018 deleted feature: DO termination statement which is not END DO or CONTINUE with label 204 at (1)
    check_poles.f:369:132:

      369 | 205 B(K)=-R(K)/RMAS
          | 1
    Warning: Fortran 2018 deleted feature: DO termination statement which is not END DO or CONTINUE with label 205 at (1)
    check_poles.f:378:132:

      378 | 206 P(K,I)=X*(Q(K,I)+B(K)*(Q(4,I)+A*BQ))
          | 1
    Warning: Fortran 2018 deleted feature: DO termination statement which is not END DO or CONTINUE with label 206 at (1)
    check_poles.f:379:132:

      379 | 207 P(0,I)=X*(G*Q(4,I)+BQ)
          | 1
    Warning: Fortran 2018 deleted feature: DO termination statement which is not END DO or CONTINUE with label 207 at (1)
    check_poles.f:401:132:

      401 | 301 P2(I)=P(0,I)**2
          | 1
    Warning: Fortran 2018 deleted feature: DO termination statement which is not END DO or CONTINUE with label 301 at (1)
    check_poles.f:411:132:

      411 | 303 G0=G0+P2(I)/E(I)
          | 1
    Warning: Fortran 2018 deleted feature: DO termination statement which is not END DO or CONTINUE with label 303 at (1)
    check_poles.f:422:132:

      422 | 306 P(K,I)=X*P(K,I)
          | 1
    Warning: Fortran 2018 deleted feature: DO termination statement which is not END DO or CONTINUE with label 306 at (1)
    check_poles.f:423:132:

      423 | 307 P(0,I)=E(I)
          | 1
    Warning: Fortran 2018 deleted feature: DO termination statement which is not END DO or CONTINUE with label 307 at (1)
    check_poles.f:430:132:

      430 | 308 WT3=WT3+V(I)**2/E(I)
          | 1
    Warning: Fortran 2018 deleted feature: DO termination statement which is not END DO or CONTINUE with label 308 at (1)
    run.inc:74:21:

       74 | common/to_rwgt/ do_rwgt_scale, rw_Fscale_down, rw_Fscale_up, rw_Rscale_down, rw_Rscale_up,
          | 1
    Warning: Padding of 4 bytes required before ‘rw_fscale_down’ in COMMON ‘to_rwgt’ at (1); reorder elements or use ‘-fno-align-commons’ [-Walign-commons]
    gfortran -O -fno-automatic -ffixed-line-length-132 -c -I. -I../../lib/ BinothLHA.f
    gfortran -O -fno-automatic -ffixed-line-length-132 -c -I. -I../../lib/ born_hel.f
    for dir in `ls -d V*`; do cd $dir; make; cd ../; done
    make[1]: Entering directory '/mnt/e/mg5_amc_v2_9_2/ee4bnunu_qcd/SubProcesses/P0_epem_vevexbbbxbx/V0_epem_vevexbbbxbx'
    rm -f ../libMadLoop.a
    gfortran -fno-automatic -ffixed-line-length-132 -O3 -c polynomial.f -o polynomial.o
    gfortran -O -fno-automatic -ffixed-line-length-132 -c loop_matrix.f -I /mnt/e/mg5_amc_v2_9_2/HEPTools/include
    gfortran -O -fno-automatic -ffixed-line-length-132 -c improve_ps.f -I /mnt/e/mg5_amc_v2_9_2/HEPTools/include
    gfortran -O -fno-automatic -ffixed-line-length-132 -c born_matrix.f -I /mnt/e/mg5_amc_v2_9_2/HEPTools/include
    born_matrix.f:1074:6:

     1074 | TMP_JAMP(110) = AMP(219) + (1) * AMP(220) ! used 2 times
          | 1
    Error: Function ‘tmp_jamp’ at (1) has no IMPLICIT type
    born_matrix.f:1075:6:

     1075 | TMP_JAMP(109) = AMP(217) + (1) * AMP(218) ! used 2 times
          | 1
    Error: Function ‘tmp_jamp’ at (1) has no IMPLICIT type
    born_matrix.f:1076:6:

     1076 | TMP_JAMP(108) = AMP(215) + (1) * AMP(216) ! used 2 times
          | 1
    Error: Function ‘tmp_jamp’ at (1) has no IMPLICIT type
    born_matrix.f:1077:6:

     1077 | TMP_JAMP(107) = AMP(213) + (1) * AMP(214) ! used 2 times
          | 1
    Error: Function ‘tmp_jamp’ at (1) has no IMPLICIT type
    born_matrix.f:1078:6:

     1078 | TMP_JAMP(106) = AMP(211) + (1) * AMP(212) ! used 2 times
          | 1
    Error: Function ‘tmp_jamp’ at (1) has no IMPLICIT type
    born_matrix.f:1079:6:

     1079 | TMP_JAMP(105) = AMP(209) + (1) * AMP(210) ! used 2 times
          | 1
    Error: Function ‘tmp_jamp’ at (1) has no IMPLICIT type
    born_matrix.f:1080:6:

     1080 | TMP_JAMP(104) = AMP(207) + (1) * AMP(208) ! used 2 times
          | 1
    Error: Function ‘tmp_jamp’ at (1) has no IMPLICIT type
    born_matrix.f:1081:6:

     1081 | TMP_JAMP(103) = AMP(205) + (1) * AMP(206) ! used 2 times
          | 1
    Error: Function ‘tmp_jamp’ at (1) has no IMPLICIT type
    born_matrix.f:1082:6:

     1082 | TMP_JAMP(102) = AMP(203) + (1) * AMP(204) ! used 2 times
          | 1
    Error: Function ‘tmp_jamp’ at (1) has no IMPLICIT type
    born_matrix.f:1083:6:

     1083 | TMP_JAMP(101) = AMP(201) + (1) * AMP(202) ! used 2 times
          | 1
    Error: Function ‘tmp_jamp’ at (1) has no IMPLICIT type
    born_matrix.f:1084:6:

     1084 | TMP_JAMP(100) = AMP(199) + (1) * AMP(200) ! used 2 times
          | 1
    Error: Function ‘tmp_jamp’ at (1) has no IMPLICIT type
    born_matrix.f:1085:6:

     1085 | TMP_JAMP(99) = AMP(197) + (1) * AMP(198) ! used 2 times
          | 1
    Error: Function ‘tmp_jamp’ at (1) has no IMPLICIT type
    born_matrix.f:1086:6:

     1086 | TMP_JAMP(98) = AMP(195) + (1) * AMP(196) ! used 2 times
          | 1
    Error: Function ‘tmp_jamp’ at (1) has no IMPLICIT type
    born_matrix.f:1087:6:

     1087 | TMP_JAMP(97) = AMP(193) + (1) * AMP(194) ! used 2 times
          | 1
    Error: Function ‘tmp_jamp’ at (1) has no IMPLICIT type
    born_matrix.f:1088:6:

     1088 | TMP_JAMP(96) = AMP(191) + (1) * AMP(192) ! used 2 times
          | 1
    Error: Function ‘tmp_jamp’ at (1) has no IMPLICIT type
    born_matrix.f:1089:6:

     1089 | TMP_JAMP(95) = AMP(189) + (1) * AMP(190) ! used 2 times
          | 1
    Error: Function ‘tmp_jamp’ at (1) has no IMPLICIT type
    born_matrix.f:1090:6:

     1090 | TMP_JAMP(94) = AMP(187) + (1) * AMP(188) ! used 2 times
          | 1
    Error: Function ‘tmp_jamp’ at (1) has no IMPLICIT type
    born_matrix.f:1091:6:

     1091 | TMP_JAMP(93) = AMP(185) + (1) * AMP(186) ! used 2 times
          | 1
    Error: Function ‘tmp_jamp’ at (1) has no IMPLICIT type
    born_matrix.f:1092:6:

     1092 | TMP_JAMP(92) = AMP(183) + (1) * AMP(184) ! used 2 times
          | 1
    Error: Function ‘tmp_jamp’ at (1) has no IMPLICIT type
    born_matrix.f:1093:6:

     1093 | TMP_JAMP(91) = AMP(181) + (1) * AMP(182) ! used 2 times
          | 1
    Error: Function ‘tmp_jamp’ at (1) has no IMPLICIT type
    born_matrix.f:1094:6:

     1094 | TMP_JAMP(90) = AMP(179) + (1) * AMP(180) ! used 2 times
          | 1
    Error: Function ‘tmp_jamp’ at (1) has no IMPLICIT type
    born_matrix.f:1095:6:

     1095 | TMP_JAMP(89) = AMP(177) + (1) * AMP(178) ! used 2 times
          | 1
    Error: Function ‘tmp_jamp’ at (1) has no IMPLICIT type
    born_matrix.f:1096:6:

     1096 | TMP_JAMP(88) = AMP(175) + (1) * AMP(176) ! used 2 times
          | 1
    Error: Function ‘tmp_jamp’ at (1) has no IMPLICIT type
    born_matrix.f:1097:6:

     1097 | TMP_JAMP(87) = AMP(173) + (1) * AMP(174) ! used 2 times
          | 1
    Error: Function ‘tmp_jamp’ at (1) has no IMPLICIT type
    born_matrix.f:1098:6:

     1098 | TMP_JAMP(86) = AMP(171) + (1) * AMP(172) ! used 2 times
          | 1
    Error: Function ‘tmp_jamp’ at (1) has no IMPLICIT type
    born_matrix.f:1099:6:

     1099 | TMP_JAMP(85) = AMP(169) + (1) * AMP(170) ! used 2 times
          | 1
    Error: Function ‘tmp_jamp’ at (1) has no IMPLICIT type
    born_matrix.f:1100:6:

     1100 | TMP_JAMP(84) = AMP(167) + (1) * AMP(168) ! used 2 times
          | 1
    Error: Function ‘tmp_jamp’ at (1) has no IMPLICIT type
    born_matrix.f:1101:6:

     1101 | TMP_JAMP(83) = AMP(165) + (1) * AMP(166) ! used 2 times
          | 1
    Error: Function ‘tmp_jamp’ at (1) has no IMPLICIT type
    born_matrix.f:1102:6:

     1102 | TMP_JAMP(82) = AMP(163) + (1) * AMP(164) ! used 2 times
          | 1
    Error: Function ‘tmp_jamp’ at (1) has no IMPLICIT type
    born_matrix.f:1103:6:

     1103 | TMP_JAMP(81) = AMP(161) + (1) * AMP(162) ! used 2 times
          | 1
    Error: Function ‘tmp_jamp’ at (1) has no IMPLICIT type
    born_matrix.f:1104:6:

     1104 | TMP_JAMP(80) = AMP(159) + (1) * AMP(160) ! used 2 times
          | 1
    Error: Function ‘tmp_jamp’ at (1) has no IMPLICIT type
    born_matrix.f:1105:6:

     1105 | TMP_JAMP(79) = AMP(157) + (1) * AMP(158) ! used 2 times
          | 1
    Error: Function ‘tmp_jamp’ at (1) has no IMPLICIT type
    born_matrix.f:1106:6:

     1106 | TMP_JAMP(78) = AMP(155) + (1) * AMP(156) ! used 2 times
          | 1
    Error: Function ‘tmp_jamp’ at (1) has no IMPLICIT type
    born_matrix.f:1107:6:

     1107 | TMP_JAMP(77) = AMP(153) + (1) * AMP(154) ! used 2 times
          | 1
    Error: Function ‘tmp_jamp’ at (1) has no IMPLICIT type
    born_matrix.f:1108:6:

     1108 | TMP_JAMP(76) = AMP(151) + (1) * AMP(152) ! used 2 times
          | 1
    Error: Function ‘tmp_jamp’ at (1) has no IMPLICIT type
    born_matrix.f:1109:6:

     1109 | TMP_JAMP(75) = AMP(149) + (1) * AMP(150) ! used 2 times
          | 1
    Error: Function ‘tmp_jamp’ at (1) has no IMPLICIT type
    born_matrix.f:1110:6:

     1110 | TMP_JAMP(74) = AMP(147) + (1) * AMP(148) ! used 2 times
          | 1
    Error: Function ‘tmp_jamp’ at (1) has no IMPLICIT type
    born_matrix.f:1111:6:

     1111 | TMP_JAMP(73) = AMP(145) + (1) * AMP(146) ! used 2 times
          | 1
    Error: Function ‘tmp_jamp’ at (1) has no IMPLICIT type
    born_matrix.f:1112:6:

     1112 | TMP_JAMP(72) = AMP(143) + (1) * AMP(144) ! used 2 times
          | 1
    Error: Function ‘tmp_jamp’ at (1) has no IMPLICIT type
    born_matrix.f:1113:6:

     1113 | TMP_JAMP(71) = AMP(141) + (1) * AMP(142) ! used 2 times
          | 1
    Error: Function ‘tmp_jamp’ at (1) has no IMPLICIT type
    born_matrix.f:1114:6:

     1114 | TMP_JAMP(70) = AMP(139) + (1) * AMP(140) ! used 2 times
          | 1
    Error: Function ‘tmp_jamp’ at (1) has no IMPLICIT type
    born_matrix.f:1115:6:

     1115 | TMP_JAMP(69) = AMP(137) + (1) * AMP(138) ! used 2 times
          | 1
    Error: Function ‘tmp_jamp’ at (1) has no IMPLICIT type
    born_matrix.f:1116:6:

     1116 | TMP_JAMP(68) = AMP(135) + (1) * AMP(136) ! used 2 times
          | 1
    Error: Function ‘tmp_jamp’ at (1) has no IMPLICIT type
    born_matrix.f:1117:6:

     1117 | TMP_JAMP(67) = AMP(133) + (1) * AMP(134) ! used 2 times
          | 1
    Error: Function ‘tmp_jamp’ at (1) has no IMPLICIT type
    born_matrix.f:1118:6:

     1118 | TMP_JAMP(66) = AMP(130) + (1) * AMP(131) ! used 2 times
          | 1
    Error: Function ‘tmp_jamp’ at (1) has no IMPLICIT type
    born_matrix.f:1119:6:

     1119 | TMP_JAMP(65) = AMP(128) + (1) * AMP(129) ! used 2 times
          | 1
    Error: Function ‘tmp_jamp’ at (1) has no IMPLICIT type
    born_matrix.f:1120:6:

     1120 | TMP_JAMP(64) = AMP(126) + (1) * AMP(127) ! used 2 times
          | 1
    Error: Function ‘tmp_jamp’ at (1) has no IMPLICIT type
    born_matrix.f:1121:6:

     1121 | TMP_JAMP(63) = AMP(124) + (1) * AMP(125) ! used 2 times
          | 1
    Error: Function ‘tmp_jamp’ at (1) has no IMPLICIT type
    born_matrix.f:1122:6:

     1122 | TMP_JAMP(62) = AMP(122) + (1) * AMP(123) ! used 2 times
          | 1
    Error: Function ‘tmp_jamp’ at (1) has no IMPLICIT type
    born_matrix.f:1123:6:

     1123 | TMP_JAMP(61) = AMP(120) + (1) * AMP(121) ! used 2 times
          | 1
    Error: Function ‘tmp_jamp’ at (1) has no IMPLICIT type
    born_matrix.f:1124:6:

     1124 | TMP_JAMP(60) = AMP(118) + (1) * AMP(119) ! used 2 times
          | 1
    Error: Function ‘tmp_jamp’ at (1) has no IMPLICIT type
    born_matrix.f:1125:6:

     1125 | TMP_JAMP(59) = AMP(116) + (1) * AMP(117) ! used 2 times
          | 1
    Error: Function ‘tmp_jamp’ at (1) has no IMPLICIT type
    born_matrix.f:1126:6:

     1126 | TMP_JAMP(58) = AMP(114) + (1) * AMP(115) ! used 2 times
          | 1
    Error: Function ‘tmp_jamp’ at (1) has no IMPLICIT type
    born_matrix.f:1127:6:

     1127 | TMP_JAMP(57) = AMP(113) + (1) * AMP(132) ! used 2 times
          | 1
    Error: Function ‘tmp_jamp’ at (1) has no IMPLICIT type
    born_matrix.f:1128:6:

     1128 | TMP_JAMP(56) = AMP(111) + (1) * AMP(112) ! used 2 times
          | 1
    Error: Function ‘tmp_jamp’ at (1) has no IMPLICIT type
    born_matrix.f:1129:6:

     1129 | TMP_JAMP(55) = AMP(109) + (1) * AMP(110) ! used 2 times
          | 1
    Error: Function ‘tmp_jamp’ at (1) has no IMPLICIT type
    born_matrix.f:1130:6:

     1130 | TMP_JAMP(54) = AMP(107) + (1) * AMP(108) ! used 2 times
          | 1
    Error: Function ‘tmp_jamp’ at (1) has no IMPLICIT type
    born_matrix.f:1131:6:

     1131 | TMP_JAMP(53) = AMP(105) + (1) * AMP(106) ! used 2 times
          | 1
    Error: Function ‘tmp_jamp’ at (1) has no IMPLICIT type
    born_matrix.f:1132:6:

     1132 | TMP_JAMP(52) = AMP(103) + (1) * AMP(104) ! used 2 times
          | 1
    Error: Function ‘tmp_jamp’ at (1) has no IMPLICIT type
    born_matrix.f:1133:6:

     1133 | TMP_JAMP(51) = AMP(101) + (1) * AMP(102) ! used 2 times
          | 1
    Error: Function ‘tmp_jamp’ at (1) has no IMPLICIT type
    born_matrix.f:1134:6:

     1134 | TMP_JAMP(50) = AMP(99) + (1) * AMP(100) ! used 2 times
          | 1
    Error: Function ‘tmp_jamp’ at (1) has no IMPLICIT type
    born_matrix.f:1135:6:

     1135 | TMP_JAMP(49) = AMP(97) + (1) * AMP(98) ! used 2 times
          | 1
    Error: Function ‘tmp_jamp’ at (1) has no IMPLICIT type
    born_matrix.f:1136:6:

     1136 | TMP_JAMP(48) = AMP(95) + (1) * AMP(96) ! used 2 times
          | 1
    Error: Function ‘tmp_jamp’ at (1) has no IMPLICIT type
    born_matrix.f:1137:6:

     1137 | TMP_JAMP(47) = AMP(93) + (1) * AMP(94) ! used 2 times
          | 1
    Error: Function ‘tmp_jamp’ at (1) has no IMPLICIT type
    born_matrix.f:1138:6:

     1138 | TMP_JAMP(46) = AMP(91) + (1) * AMP(92) ! used 2 times
          | 1
    Error: Function ‘tmp_jamp’ at (1) has no IMPLICIT type
    born_matrix.f:1139:6:

     1139 | TMP_JAMP(45) = AMP(89) + (1) * AMP(90) ! used 2 times
          | 1
    Error: Function ‘tmp_jamp’ at (1) has no IMPLICIT type
    born_matrix.f:1140:6:

     1140 | TMP_JAMP(44) = AMP(87) + (1) * AMP(88) ! used 2 times
          | 1
    Error: Function ‘tmp_jamp’ at (1) has no IMPLICIT type
    born_matrix.f:1141:6:

     1141 | TMP_JAMP(43) = AMP(85) + (1) * AMP(86) ! used 2 times
          | 1
    Error: Function ‘tmp_jamp’ at (1) has no IMPLICIT type
    born_matrix.f:1142:6:

     1142 | TMP_JAMP(42) = AMP(83) + (1) * AMP(84) ! used 2 times
          | 1
    Error: Function ‘tmp_jamp’ at (1) has no IMPLICIT type
    born_matrix.f:1143:6:

     1143 | TMP_JAMP(41) = AMP(81) + (1) * AMP(82) ! used 2 times
          | 1
    Error: Function ‘tmp_jamp’ at (1) has no IMPLICIT type
    born_matrix.f:1144:6:

     1144 | TMP_JAMP(40) = AMP(79) + (1) * AMP(80) ! used 2 times
          | 1
    Error: Function ‘tmp_jamp’ at (1) has no IMPLICIT type
    born_matrix.f:1145:6:

     1145 | TMP_JAMP(39) = AMP(77) + (1) * AMP(78) ! used 2 times
          | 1
    Error: Function ‘tmp_jamp’ at (1) has no IMPLICIT type
    born_matrix.f:1146:6:

     1146 | TMP_JAMP(38) = AMP(75) + (1) * AMP(76) ! used 2 times
          | 1
    Error: Function ‘tmp_jamp’ at (1) has no IMPLICIT type
    born_matrix.f:1147:6:

     1147 | TMP_JAMP(37) = AMP(73) + (1) * AMP(74) ! used 2 times
          | 1
    Error: Function ‘tmp_jamp’ at (1) has no IMPLICIT type
    born_matrix.f:1148:6:

     1148 | TMP_JAMP(36) = AMP(71) + (1) * AMP(72) ! used 2 times
          | 1
    Error: Function ‘tmp_jamp’ at (1) has no IMPLICIT type
    born_matrix.f:1149:6:

     1149 | TMP_JAMP(35) = AMP(69) + (1) * AMP(70) ! used 2 times
          | 1
    Error: Function ‘tmp_jamp’ at (1) has no IMPLICIT type
    born_matrix.f:1150:6:

     1150 | TMP_JAMP(34) = AMP(67) + (1) * AMP(68) ! used 2 times
          | 1
    Error: Function ‘tmp_jamp’ at (1) has no IMPLICIT type
    born_matrix.f:1151:6:

     1151 | TMP_JAMP(33) = AMP(65) + (1) * AMP(66) ! used 2 times
          | 1
    Error: Function ‘tmp_jamp’ at (1) has no IMPLICIT type
    born_matrix.f:1152:6:

     1152 | TMP_JAMP(32) = AMP(63) + (1) * AMP(64) ! used 2 times
          | 1
    Error: Function ‘tmp_jamp’ at (1) has no IMPLICIT type
    born_matrix.f:1153:6:

     1153 | TMP_JAMP(31) = AMP(61) + (1) * AMP(62) ! used 2 times
          | 1
    Error: Function ‘tmp_jamp’ at (1) has no IMPLICIT type
    born_matrix.f:1154:6:

     1154 | TMP_JAMP(30) = AMP(59) + (1) * AMP(60) ! used 2 times
          | 1
    Error: Function ‘tmp_jamp’ at (1) has no IMPLICIT type
    born_matrix.f:1155:6:

     1155 | TMP_JAMP(29) = AMP(57) + (1) * AMP(58) ! used 2 times
          | 1
    Error: Function ‘tmp_jamp’ at (1) has no IMPLICIT type
    born_matrix.f:1156:6:

     1156 | TMP_JAMP(28) = AMP(55) + (1) * AMP(56) ! used 2 times
          | 1
    Error: Function ‘tmp_jamp’ at (1) has no IMPLICIT type
    born_matrix.f:1157:6:

     1157 | TMP_JAMP(27) = AMP(53) + (1) * AMP(54) ! used 2 times
          | 1
    Error: Function ‘tmp_jamp’ at (1) has no IMPLICIT type
    born_matrix.f:1158:6:

     1158 | TMP_JAMP(26) = AMP(51) + (1) * AMP(52) ! used 2 times
          | 1
    Error: Function ‘tmp_jamp’ at (1) has no IMPLICIT type
    born_matrix.f:1159:6:

     1159 | TMP_JAMP(25) = AMP(49) + (1) * AMP(50) ! used 2 times
          | 1
    Error: Function ‘tmp_jamp’ at (1) has no IMPLICIT type
    born_matrix.f:1160:6:

     1160 | TMP_JAMP(24) = AMP(47) + (1) * AMP(48) ! used 2 times
          | 1
    Error: Function ‘tmp_jamp’ at (1) has no IMPLICIT type
    born_matrix.f:1161:6:

     1161 | TMP_JAMP(23) = AMP(45) + (1) * AMP(46) ! used 2 times
          | 1
    Error: Function ‘tmp_jamp’ at (1) has no IMPLICIT type
    born_matrix.f:1162:6:

     1162 | TMP_JAMP(22) = AMP(43) + (1) * AMP(44) ! used 2 times
          | 1
    Error: Function ‘tmp_jamp’ at (1) has no IMPLICIT type
    born_matrix.f:1163:6:

     1163 | TMP_JAMP(21) = AMP(41) + (1) * AMP(42) ! used 2 times
          | 1
    Error: Function ‘tmp_jamp’ at (1) has no IMPLICIT type
    born_matrix.f:1164:6:

     1164 | TMP_JAMP(20) = AMP(39) + (1) * AMP(40) ! used 2 times
          | 1
    Error: Function ‘tmp_jamp’ at (1) has no IMPLICIT type
    born_matrix.f:1165:6:

     1165 | TMP_JAMP(19) = AMP(37) + (1) * AMP(38) ! used 2 times
          | 1
    Error: Function ‘tmp_jamp’ at (1) has no IMPLICIT type
    born_matrix.f:1166:6:

     1166 | TMP_JAMP(18) = AMP(35) + (1) * AMP(36) ! used 2 times
          | 1
    Error: Function ‘tmp_jamp’ at (1) has no IMPLICIT type
    born_matrix.f:1167:6:

     1167 | TMP_JAMP(17) = AMP(33) + (1) * AMP(34) ! used 2 times
          | 1
    Error: Function ‘tmp_jamp’ at (1) has no IMPLICIT type
    born_matrix.f:1168:6:

     1168 | TMP_JAMP(16) = AMP(30) + (1) * AMP(31) ! used 2 times
          | 1
    Error: Function ‘tmp_jamp’ at (1) has no IMPLICIT type
    born_matrix.f:1169:6:

     1169 | TMP_JAMP(15) = AMP(29) + (1) * AMP(32) ! used 2 times
          | 1
    Error: Function ‘tmp_jamp’ at (1) has no IMPLICIT type
    born_matrix.f:1170:6:

     1170 | TMP_JAMP(14) = AMP(26) + (1) * AMP(27) ! used 2 times
          | 1
    Error: Function ‘tmp_jamp’ at (1) has no IMPLICIT type
    born_matrix.f:1171:6:

     1171 | TMP_JAMP(13) = AMP(25) + (1) * AMP(28) ! used 2 times
          | 1
    Error: Function ‘tmp_jamp’ at (1) has no IMPLICIT type
    born_matrix.f:1172:6:

     1172 | TMP_JAMP(12) = AMP(22) + (1) * AMP(23) ! used 2 times
          | 1
    Error: Function ‘tmp_jamp’ at (1) has no IMPLICIT type
    born_matrix.f:1173:6:

     1173 | TMP_JAMP(11) = AMP(21) + (1) * AMP(24) ! used 2 times
          | 1
    Error: Function ‘tmp_jamp’ at (1) has no IMPLICIT type
    born_matrix.f:1174:6:

     1174 | TMP_JAMP(10) = AMP(18) + (1) * AMP(19) ! used 2 times
          | 1
    Error: Function ‘tmp_jamp’ at (1) has no IMPLICIT type
    born_matrix.f:1175:6:

     1175 | TMP_JAMP(9) = AMP(17) + (1) * AMP(20) ! used 2 times
          | 1
    Error: Function ‘tmp_jamp’ at (1) has no IMPLICIT type
    born_matrix.f:1176:6:

     1176 | TMP_JAMP(8) = AMP(14) + (1) * AMP(15) ! used 2 times
          | 1
    Error: Function ‘tmp_jamp’ at (1) has no IMPLICIT type
    born_matrix.f:1177:6:

     1177 | TMP_JAMP(7) = AMP(13) + (1) * AMP(16) ! used 2 times
          | 1
    Error: Function ‘tmp_jamp’ at (1) has no IMPLICIT type
    born_matrix.f:1178:6:

     1178 | TMP_JAMP(6) = AMP(10) + (1) * AMP(11) ! used 2 times
          | 1
    Error: Function ‘tmp_jamp’ at (1) has no IMPLICIT type
    born_matrix.f:1179:6:

     1179 | TMP_JAMP(5) = AMP(9) + (1) * AMP(12) ! used 2 times
          | 1
    Error: Function ‘tmp_jamp’ at (1) has no IMPLICIT type
    born_matrix.f:1180:6:

     1180 | TMP_JAMP(4) = AMP(6) + (1) * AMP(7) ! used 2 times
          | 1
    Error: Function ‘tmp_jamp’ at (1) has no IMPLICIT type
    born_matrix.f:1181:6:

     1181 | TMP_JAMP(3) = AMP(5) + (1) * AMP(8) ! used 2 times
          | 1
    Error: Function ‘tmp_jamp’ at (1) has no IMPLICIT type
    born_matrix.f:1182:6:

     1182 | TMP_JAMP(2) = AMP(2) + (1) * AMP(3) ! used 2 times
          | 1
    Error: Function ‘tmp_jamp’ at (1) has no IMPLICIT type
    born_matrix.f:1183:6:

     1183 | TMP_JAMP(1) = AMP(1) + (1) * AMP(4) ! used 2 times
          | 1
    Error: Function ‘tmp_jamp’ at (1) has no IMPLICIT type
    born_matrix.f:1184:6:

     1184 | TMP_JAMP(164) = TMP_JAMP(5) + (1) * TMP_JAMP(3) ! used 2 times
          | 1
    Error: Function ‘tmp_jamp’ at (1) has no IMPLICIT type
    born_matrix.f:1184:50:

     1184 | TMP_JAMP(164) = TMP_JAMP(5) + (1) * TMP_JAMP(3) ! used 2 times
          | 1
    Error: Function ‘tmp_jamp’ at (1) has no IMPLICIT type
    born_matrix.f:1185:6:

     1185 | TMP_JAMP(163) = TMP_JAMP(6) + (1) * TMP_JAMP(4) ! used 2 times
          | 1
    Error: Function ‘tmp_jamp’ at (1) has no IMPLICIT type
    born_matrix.f:1185:50:

     1185 | TMP_JAMP(163) = TMP_JAMP(6) + (1) * TMP_JAMP(4) ! used 2 times
          | 1
    Error: Function ‘tmp_jamp’ at (1) has no IMPLICIT type
    born_matrix.f:1186:6:

     1186 | TMP_JAMP(162) = TMP_JAMP(9) + (1) * TMP_JAMP(7) ! used 2 times
          | 1
    Error: Function ‘tmp_jamp’ at (1) has no IMPLICIT type
    born_matrix.f:1186:50:

     1186 | TMP_JAMP(162) = TMP_JAMP(9) + (1) * TMP_JAMP(7) ! used 2 times
          | 1
    Error: Function ‘tmp_jamp’ at (1) has no IMPLICIT type
    born_matrix.f:1187:6:

     1187 | TMP_JAMP(161) = TMP_JAMP(10) + (1) * TMP_JAMP(8) ! used 2 times
          | 1
    Error: Function ‘tmp_jamp’ at (1) has no IMPLICIT type
    born_matrix.f:1187:51:

     1187 | TMP_JAMP(161) = TMP_JAMP(10) + (1) * TMP_JAMP(8) ! used 2 times
          | 1
    Error: Function ‘tmp_jamp’ at (1) has no IMPLICIT type
    born_matrix.f:1188:6:

     1188 | TMP_JAMP(160) = TMP_JAMP(13) + (1) * TMP_JAMP(11) ! used 2 times
          | 1
    Error: Function ‘tmp_jamp’ at (1) has no IMPLICIT type
    born_matrix.f:1188:51:

     1188 | TMP_JAMP(160) = TMP_JAMP(13) + (1) * TMP_JAMP(11) ! used 2 times
          | 1
    Error: Function ‘tmp_jamp’ at (1) has no IMPLICIT type
    born_matrix.f:1189:6:

     1189 | TMP_JAMP(159) = TMP_JAMP(14) + (1) * TMP_JAMP(12) ! used 2 times
          | 1
    Error: Function ‘tmp_jamp’ at (1) has no IMPLICIT type
    born_matrix.f:1189:51:

     1189 | TMP_JAMP(159) = TMP_JAMP(14) + (1) * TMP_JAMP(12) ! used 2 times
          | 1
    Error: Function ‘tmp_jamp’ at (1) has no IMPLICIT type
    born_matrix.f:1190:6:

     1190 | TMP_JAMP(158) = TMP_JAMP(17) + (1) * TMP_JAMP(15) ! used 2 times
          | 1
    Error: Function ‘tmp_jamp’ at (1) has no IMPLICIT type
    born_matrix.f:1190:51:

     1190 | TMP_JAMP(158) = TMP_JAMP(17) + (1) * TMP_JAMP(15) ! used 2 times
          | 1
    Error: Function ‘tmp_jamp’ at (1) has no IMPLICIT type
    born_matrix.f:1191:6:

     1191 | TMP_JAMP(157) = TMP_JAMP(19) + (1) * TMP_JAMP(18) ! used 2 times
          | 1
    Error: Function ‘tmp_jamp’ at (1) has no IMPLICIT type
    born_matrix.f:1191:51:

     1191 | TMP_JAMP(157) = TMP_JAMP(19) + (1) * TMP_JAMP(18) ! used 2 times
          | 1
    Error: Function ‘tmp_jamp’ at (1) has no IMPLICIT type
    born_matrix.f:1192:6:

     1192 | TMP_JAMP(156) = TMP_JAMP(21) + (1) * TMP_JAMP(20) ! used 2 times
          | 1
    Error: Function ‘tmp_jamp’ at (1) has no IMPLICIT type
    born_matrix.f:1192:51:

     1192 | TMP_JAMP(156) = TMP_JAMP(21) + (1) * TMP_JAMP(20) ! used 2 times
          | 1
    Error: Function ‘tmp_jamp’ at (1) has no IMPLICIT type
    born_matrix.f:1193:6:

     1193 | TMP_JAMP(155) = TMP_JAMP(23) + (1) * TMP_JAMP(22) ! used 2 times
          | 1
    Error: Function ‘tmp_jamp’ at (1) has no IMPLICIT type
    born_matrix.f:1193:51:

     1193 | TMP_JAMP(155) = TMP_JAMP(23) + (1) * TMP_JAMP(22) ! used 2 times
          | 1
    Error: Function ‘tmp_jamp’ at (1) has no IMPLICIT type
    born_matrix.f:1194:6:

     1194 | TMP_JAMP(154) = TMP_JAMP(24) + (1) * TMP_JAMP(16) ! used 2 times
          | 1
    Error: Function ‘tmp_jamp’ at (1) has no IMPLICIT type
    born_matrix.f:1194:51:

     1194 | TMP_JAMP(154) = TMP_JAMP(24) + (1) * TMP_JAMP(16) ! used 2 times
          | 1
    Error: Function ‘tmp_jamp’ at (1) has no IMPLICIT type
    born_matrix.f:1195:6:

     1195 | TMP_JAMP(153) = TMP_JAMP(26) + (1) * TMP_JAMP(25) ! used 2 times
          | 1
    Error: Function ‘tmp_jamp’ at (1) has no IMPLICIT type
    born_matrix.f:1195:51:

     1195 | TMP_JAMP(153) = TMP_JAMP(26) + (1) * TMP_JAMP(25) ! used 2 times
          | 1
    Error: Function ‘tmp_jamp’ at (1) has no IMPLICIT type
    born_matrix.f:1196:6:

     1196 | TMP_JAMP(152) = TMP_JAMP(28) + (1) * TMP_JAMP(27) ! used 2 times
          | 1
    Error: Function ‘tmp_jamp’ at (1) has no IMPLICIT type
    born_matrix.f:1196:51:

     1196 | TMP_JAMP(152) = TMP_JAMP(28) + (1) * TMP_JAMP(27) ! used 2 times
          | 1
    Error: Function ‘tmp_jamp’ at (1) has no IMPLICIT type
    born_matrix.f:1197:6:

     1197 | TMP_JAMP(151) = TMP_JAMP(30) + (1) * TMP_JAMP(29) ! used 2 times
          | 1
    Error: Function ‘tmp_jamp’ at (1) has no IMPLICIT type
    born_matrix.f:1197:51:

     1197 | TMP_JAMP(151) = TMP_JAMP(30) + (1) * TMP_JAMP(29) ! used 2 times
          | 1
    Error: Function ‘tmp_jamp’ at (1) has no IMPLICIT type
    born_matrix.f:1198:6:

     1198 | TMP_JAMP(150) = TMP_JAMP(32) + (1) * TMP_JAMP(31) ! used 2 times
          | 1
    Error: Function ‘tmp_jamp’ at (1) has no IMPLICIT type
    born_matrix.f:1198:51:

     1198 | TMP_JAMP(150) = TMP_JAMP(32) + (1) * TMP_JAMP(31) ! used 2 times
          | 1
    Error: Function ‘tmp_jamp’ at (1) has no IMPLICIT type
    born_matrix.f:1199:6:

     1199 | TMP_JAMP(149) = TMP_JAMP(34) + (1) * TMP_JAMP(33) ! used 2 times
          | 1
    Error: Function ‘tmp_jamp’ at (1) has no IMPLICIT type
    born_matrix.f:1199:51:

     1199 | TMP_JAMP(149) = TMP_JAMP(34) + (1) * TMP_JAMP(33) ! used 2 times
          | 1
    Error: Function ‘tmp_jamp’ at (1) has no IMPLICIT type
    born_matrix.f:1200:6:

     1200 | TMP_JAMP(148) = TMP_JAMP(36) + (1) * TMP_JAMP(35) ! used 2 times
          | 1
    Error: Function ‘tmp_jamp’ at (1) has no IMPLICIT type
    born_matrix.f:1200:51:

     1200 | TMP_JAMP(148) = TMP_JAMP(36) + (1) * TMP_JAMP(35) ! used 2 times
          | 1
    Error: Function ‘tmp_jamp’ at (1) has no IMPLICIT type
    born_matrix.f:1201:6:

     1201 | TMP_JAMP(147) = TMP_JAMP(39) + (1) * TMP_JAMP(38) ! used 2 times
          | 1
    Error: Function ‘tmp_jamp’ at (1) has no IMPLICIT type
    born_matrix.f:1201:51:

     1201 | TMP_JAMP(147) = TMP_JAMP(39) + (1) * TMP_JAMP(38) ! used 2 times
          | 1
    Error: Function ‘tmp_jamp’ at (1) has no IMPLICIT type
    born_matrix.f:1202:6:

     1202 | TMP_JAMP(146) = TMP_JAMP(41) + (1) * TMP_JAMP(40) ! used 2 times
          | 1
    Error: Function ‘tmp_jamp’ at (1) has no IMPLICIT type
    born_matrix.f:1202:51:

     1202 | TMP_JAMP(146) = TMP_JAMP(41) + (1) * TMP_JAMP(40) ! used 2 times
          | 1
    Error: Function ‘tmp_jamp’ at (1) has no IMPLICIT type
    born_matrix.f:1203:6:

     1203 | TMP_JAMP(145) = TMP_JAMP(43) + (1) * TMP_JAMP(42) ! used 2 times
          | 1
    Error: Function ‘tmp_jamp’ at (1) has no IMPLICIT type
    born_matrix.f:1203:51:

     1203 | TMP_JAMP(145) = TMP_JAMP(43) + (1) * TMP_JAMP(42) ! used 2 times
          | 1
    Error: Function ‘tmp_jamp’ at (1) has no IMPLICIT type
    born_matrix.f:1204:6:

     1204 | TMP_JAMP(144) = TMP_JAMP(45) + (1) * TMP_JAMP(44) ! used 2 times
          | 1
    Error: Function ‘tmp_jamp’ at (1) has no IMPLICIT type
    born_matrix.f:1204:51:

     1204 | TMP_JAMP(144) = TMP_JAMP(45) + (1) * TMP_JAMP(44) ! used 2 times
          | 1
    Error: Function ‘tmp_jamp’ at (1) has no IMPLICIT type
    born_matrix.f:1205:6:

     1205 | TMP_JAMP(143) = TMP_JAMP(47) + (1) * TMP_JAMP(37) ! used 2 times
          | 1
    Error: Function ‘tmp_jamp’ at (1) has no IMPLICIT type
    born_matrix.f:1205:51:

     1205 | TMP_JAMP(143) = TMP_JAMP(47) + (1) * TMP_JAMP(37) ! used 2 times
          | 1
    Error: Function ‘tmp_jamp’ at (1) has no IMPLICIT type
    born_matrix.f:1206:6:

     1206 | TMP_JAMP(142) = TMP_JAMP(49) + (1) * TMP_JAMP(48) ! used 2 times
          | 1
    Error: Function ‘tmp_jamp’ at (1) has no IMPLICIT type
    born_matrix.f:1206:51:

     1206 | TMP_JAMP(142) = TMP_JAMP(49) + (1) * TMP_JAMP(48) ! used 2 times
          | 1
    Error: Function ‘tmp_jamp’ at (1) has no IMPLICIT type
    born_matrix.f:1207:6:

     1207 | TMP_JAMP(141) = TMP_JAMP(51) + (1) * TMP_JAMP(46) ! used 2 times
          | 1
    Error: Function ‘tmp_jamp’ at (1) has no IMPLICIT type
    born_matrix.f:1207:51:

     1207 | TMP_JAMP(141) = TMP_JAMP(51) + (1) * TMP_JAMP(46) ! used 2 times
          | 1
    Error: Function ‘tmp_jamp’ at (1) has no IMPLICIT type
    born_matrix.f:1208:6:

     1208 | TMP_JAMP(140) = TMP_JAMP(53) + (-1) * TMP_JAMP(52) ! used 2 times
          | 1
    Error: Function ‘tmp_jamp’ at (1) has no IMPLICIT type
    born_matrix.f:1208:52:

     1208 | TMP_JAMP(140) = TMP_JAMP(53) + (-1) * TMP_JAMP(52) ! used 2 times
          | 1
    Error: Function ‘tmp_jamp’ at (1) has no IMPLICIT type
    born_matrix.f:1209:6:

     1209 | TMP_JAMP(139) = TMP_JAMP(55) + (1) * TMP_JAMP(54) ! used 2 times
          | 1
    Error: Function ‘tmp_jamp’ at (1) has no IMPLICIT type
    born_matrix.f:1209:51:

     1209 | TMP_JAMP(139) = TMP_JAMP(55) + (1) * TMP_JAMP(54) ! used 2 times
          | 1
    Error: Function ‘tmp_jamp’ at (1) has no IMPLICIT type
    born_matrix.f:1210:6:

     1210 | TMP_JAMP(138) = TMP_JAMP(57) + (1) * TMP_JAMP(56) ! used 2 times
          | 1
    Error: Function ‘tmp_jamp’ at (1) has no IMPLICIT type
    born_matrix.f:1210:51:

     1210 | TMP_JAMP(138) = TMP_JAMP(57) + (1) * TMP_JAMP(56) ! used 2 times
          | 1
    Error: Function ‘tmp_jamp’ at (1) has no IMPLICIT type
    born_matrix.f:1211:6:

     1211 | TMP_JAMP(137) = TMP_JAMP(58) + (-1) * TMP_JAMP(50) ! used 2 times
          | 1
    Error: Function ‘tmp_jamp’ at (1) has no IMPLICIT type
    born_matrix.f:1211:52:

     1211 | TMP_JAMP(137) = TMP_JAMP(58) + (-1) * TMP_JAMP(50) ! used 2 times
          | 1
    Error: Function ‘tmp_jamp’ at (1) has no IMPLICIT type
    born_matrix.f:1212:6:

     1212 | TMP_JAMP(136) = TMP_JAMP(60) + (1) * TMP_JAMP(59) ! used 2 times
          | 1
    Error: Function ‘tmp_jamp’ at (1) has no IMPLICIT type
    born_matrix.f:1212:51:

     1212 | TMP_JAMP(136) = TMP_JAMP(60) + (1) * TMP_JAMP(59) ! used 2 times
          | 1
    Error: Function ‘tmp_jamp’ at (1) has no IMPLICIT type
    born_matrix.f:1213:6:

     1213 | TMP_JAMP(135) = TMP_JAMP(62) + (1) * TMP_JAMP(61) ! used 2 times
          | 1
    Error: Function ‘tmp_jamp’ at (1) has no IMPLICIT type
    born_matrix.f:1213:51:

     1213 | TMP_JAMP(135) = TMP_JAMP(62) + (1) * TMP_JAMP(61) ! used 2 times
          | 1
    Error: Function ‘tmp_jamp’ at (1) has no IMPLICIT type
    born_matrix.f:1214:6:

     1214 | TMP_JAMP(134) = TMP_JAMP(64) + (1) * TMP_JAMP(63) ! used 2 times
          | 1
    Error: Function ‘tmp_jamp’ at (1) has no IMPLICIT type
    born_matrix.f:1214:51:

     1214 | TMP_JAMP(134) = TMP_JAMP(64) + (1) * TMP_JAMP(63) ! used 2 times
          | 1
    Error: Function ‘tmp_jamp’ at (1) has no IMPLICIT type
    born_matrix.f:1215:6:

     1215 | TMP_JAMP(133) = TMP_JAMP(66) + (1) * TMP_JAMP(65) ! used 2 times
          | 1
    Error: Function ‘tmp_jamp’ at (1) has no IMPLICIT type
    born_matrix.f:1215:51:

     1215 | TMP_JAMP(133) = TMP_JAMP(66) + (1) * TMP_JAMP(65) ! used 2 times
          | 1
    Error: Function ‘tmp_jamp’ at (1) has no IMPLICIT type
    born_matrix.f:1216:6:

     1216 | TMP_JAMP(132) = TMP_JAMP(68) + (1) * TMP_JAMP(67) ! used 2 times
          | 1
    Error: Function ‘tmp_jamp’ at (1) has no IMPLICIT type
    born_matrix.f:1216:51:

     1216 | TMP_JAMP(132) = TMP_JAMP(68) + (1) * TMP_JAMP(67) ! used 2 times
          | 1
    Error: Function ‘tmp_jamp’ at (1) has no IMPLICIT type
    born_matrix.f:1217:6:

     1217 | TMP_JAMP(131) = TMP_JAMP(70) + (1) * TMP_JAMP(69) ! used 2 times
          | 1
    Error: Function ‘tmp_jamp’ at (1) has no IMPLICIT type
    born_matrix.f:1217:51:

     1217 | TMP_JAMP(131) = TMP_JAMP(70) + (1) * TMP_JAMP(69) ! used 2 times
          | 1
    Error: Function ‘tmp_jamp’ at (1) has no IMPLICIT type
    born_matrix.f:1218:6:

     1218 | TMP_JAMP(130) = TMP_JAMP(72) + (1) * TMP_JAMP(71) ! used 2 times
          | 1
    Error: Function ‘tmp_jamp’ at (1) has no IMPLICIT type
    born_matrix.f:1218:51:

     1218 | TMP_JAMP(130) = TMP_JAMP(72) + (1) * TMP_JAMP(71) ! used 2 times
          | 1
    Error: Function ‘tmp_jamp’ at (1) has no IMPLICIT type
    born_matrix.f:1219:6:

     1219 | TMP_JAMP(129) = TMP_JAMP(75) + (1) * TMP_JAMP(74) ! used 2 times
          | 1
    Error: Function ‘tmp_jamp’ at (1) has no IMPLICIT type
    born_matrix.f:1219:51:

     1219 | TMP_JAMP(129) = TMP_JAMP(75) + (1) * TMP_JAMP(74) ! used 2 times
          | 1
    Error: Function ‘tmp_jamp’ at (1) has no IMPLICIT type
    born_matrix.f:1220:6:

     1220 | TMP_JAMP(128) = TMP_JAMP(77) + (1) * TMP_JAMP(76) ! used 2 times
          | 1
    Error: Function ‘tmp_jamp’ at (1) has no IMPLICIT type
    born_matrix.f:1220:51:

     1220 | TMP_JAMP(128) = TMP_JAMP(77) + (1) * TMP_JAMP(76) ! used 2 times
          | 1
    Error: Function ‘tmp_jamp’ at (1) has no IMPLICIT type
    born_matrix.f:1221:6:

     1221 | TMP_JAMP(127) = TMP_JAMP(79) + (1) * TMP_JAMP(78) ! used 2 times
          | 1
    Error: Function ‘tmp_jamp’ at (1) has no IMPLICIT type
    born_matrix.f:1221:51:

     1221 | TMP_JAMP(127) = TMP_JAMP(79) + (1) * TMP_JAMP(78) ! used 2 times
          | 1
    Error: Function ‘tmp_jamp’ at (1) has no IMPLICIT type
    born_matrix.f:1222:6:

     1222 | TMP_JAMP(126) = TMP_JAMP(80) + (1) * TMP_JAMP(73) ! used 2 times
          | 1
    Error: Function ‘tmp_jamp’ at (1) has no IMPLICIT type
    born_matrix.f:1222:51:

     1222 | TMP_JAMP(126) = TMP_JAMP(80) + (1) * TMP_JAMP(73) ! used 2 times
          | 1
    Error: Function ‘tmp_jamp’ at (1) has no IMPLICIT type
    born_matrix.f:1223:6:

     1223 | TMP_JAMP(125) = TMP_JAMP(82) + (1) * TMP_JAMP(81) ! used 2 times
          | 1
    Error: Function ‘tmp_jamp’ at (1) has no IMPLICIT type
    born_matrix.f:1223:51:

     1223 | TMP_JAMP(125) = TMP_JAMP(82) + (1) * TMP_JAMP(81) ! used 2 times
          | 1
    Error: Function ‘tmp_jamp’ at (1) has no IMPLICIT type
    born_matrix.f:1224:6:

     1224 | TMP_JAMP(124) = TMP_JAMP(84) + (1) * TMP_JAMP(83) ! used 2 times
          | 1
    Error: Function ‘tmp_jamp’ at (1) has no IMPLICIT type
    born_matrix.f:1224:51:

     1224 | TMP_JAMP(124) = TMP_JAMP(84) + (1) * TMP_JAMP(83) ! used 2 times
          | 1
    Error: Function ‘tmp_jamp’ at (1) has no IMPLICIT type
    born_matrix.f:1225:6:

     1225 | TMP_JAMP(123) = TMP_JAMP(87) + (1) * TMP_JAMP(86) ! used 2 times
          | 1
    Error: Function ‘tmp_jamp’ at (1) has no IMPLICIT type
    born_matrix.f:1225:51:

     1225 | TMP_JAMP(123) = TMP_JAMP(87) + (1) * TMP_JAMP(86) ! used 2 times
          | 1
    Error: Function ‘tmp_jamp’ at (1) has no IMPLICIT type
    born_matrix.f:1226:6:

     1226 | TMP_JAMP(122) = TMP_JAMP(89) + (1) * TMP_JAMP(88) ! used 2 times
          | 1
    Error: Function ‘tmp_jamp’ at (1) has no IMPLICIT type
    born_matrix.f:1226:51:

     1226 | TMP_JAMP(122) = TMP_JAMP(89) + (1) * TMP_JAMP(88) ! used 2 times
          | 1
    Error: Function ‘tmp_jamp’ at (1) has no IMPLICIT type
    born_matrix.f:1227:6:

     1227 | TMP_JAMP(121) = TMP_JAMP(91) + (1) * TMP_JAMP(90) ! used 2 times
          | 1
    Error: Function ‘tmp_jamp’ at (1) has no IMPLICIT type
    born_matrix.f:1227:51:

     1227 | TMP_JAMP(121) = TMP_JAMP(91) + (1) * TMP_JAMP(90) ! used 2 times
          | 1
    Error: Function ‘tmp_jamp’ at (1) has no IMPLICIT type
    born_matrix.f:1228:6:

     1228 | TMP_JAMP(120) = TMP_JAMP(92) + (1) * TMP_JAMP(85) ! used 2 times
          | 1
    Error: Function ‘tmp_jamp’ at (1) has no IMPLICIT type
    born_matrix.f:1228:51:

     1228 | TMP_JAMP(120) = TMP_JAMP(92) + (1) * TMP_JAMP(85) ! used 2 times
          | 1
    Error: Function ‘tmp_jamp’ at (1) has no IMPLICIT type
    born_matrix.f:1229:6:

     1229 | TMP_JAMP(119) = TMP_JAMP(94) + (1) * TMP_JAMP(93) ! used 2 times
          | 1
    Error: Function ‘tmp_jamp’ at (1) has no IMPLICIT type
    born_matrix.f:1229:51:

     1229 | TMP_JAMP(119) = TMP_JAMP(94) + (1) * TMP_JAMP(93) ! used 2 times
          | 1
    Error: Function ‘tmp_jamp’ at (1) has no IMPLICIT type
    born_matrix.f:1230:6:

     1230 | TMP_JAMP(118) = TMP_JAMP(96) + (1) * TMP_JAMP(95) ! used 2 times
          | 1
    Error: Function ‘tmp_jamp’ at (1) has no IMPLICIT type
    born_matrix.f:1230:51:

     1230 | TMP_JAMP(118) = TMP_JAMP(96) + (1) * TMP_JAMP(95) ! used 2 times
          | 1
    Error: Function ‘tmp_jamp’ at (1) has no IMPLICIT type
    born_matrix.f:1231:6:

     1231 | TMP_JAMP(117) = TMP_JAMP(98) + (1) * TMP_JAMP(97) ! used 2 times
          | 1
    Error: Function ‘tmp_jamp’ at (1) has no IMPLICIT type
    born_matrix.f:1231:51:

     1231 | TMP_JAMP(117) = TMP_JAMP(98) + (1) * TMP_JAMP(97) ! used 2 times
          | 1
    Error: Function ‘tmp_jamp’ at (1) has no IMPLICIT type
    born_matrix.f:1232:6:

     1232 | TMP_JAMP(116) = TMP_JAMP(100) + (1) * TMP_JAMP(99) ! used 2 times
          | 1
    Error: Function ‘tmp_jamp’ at (1) has no IMPLICIT type
    born_matrix.f:1232:52:

     1232 | TMP_JAMP(116) = TMP_JAMP(100) + (1) * TMP_JAMP(99) ! used 2 times
          | 1
    Error: Function ‘tmp_jamp’ at (1) has no IMPLICIT type
    born_matrix.f:1233:6:

     1233 | TMP_JAMP(115) = TMP_JAMP(102) + (1) * TMP_JAMP(101) ! used 2 times
          | 1
    Error: Function ‘tmp_jamp’ at (1) has no IMPLICIT type
    born_matrix.f:1233:52:

     1233 | TMP_JAMP(115) = TMP_JAMP(102) + (1) * TMP_JAMP(101) ! used 2 times
          | 1
    Error: Function ‘tmp_jamp’ at (1) has no IMPLICIT type
    born_matrix.f:1234:6:

     1234 | TMP_JAMP(114) = TMP_JAMP(104) + (1) * TMP_JAMP(103) ! used 2 times
          | 1
    Error: Function ‘tmp_jamp’ at (1) has no IMPLICIT type
    born_matrix.f:1234:52:

     1234 | TMP_JAMP(114) = TMP_JAMP(104) + (1) * TMP_JAMP(103) ! used 2 times
          | 1
    Error: Function ‘tmp_jamp’ at (1) has no IMPLICIT type
    born_matrix.f:1235:6:

     1235 | TMP_JAMP(113) = TMP_JAMP(106) + (1) * TMP_JAMP(105) ! used 2 times
          | 1
    Error: Function ‘tmp_jamp’ at (1) has no IMPLICIT type
    born_matrix.f:1235:52:

     1235 | TMP_JAMP(113) = TMP_JAMP(106) + (1) * TMP_JAMP(105) ! used 2 times
          | 1
    Error: Function ‘tmp_jamp’ at (1) has no IMPLICIT type
    born_matrix.f:1236:6:

     1236 | TMP_JAMP(112) = TMP_JAMP(108) + (1) * TMP_JAMP(107) ! used 2 times
          | 1
    Error: Function ‘tmp_jamp’ at (1) has no IMPLICIT type
    born_matrix.f:1236:52:

     1236 | TMP_JAMP(112) = TMP_JAMP(108) + (1) * TMP_JAMP(107) ! used 2 times
          | 1
    Error: Function ‘tmp_jamp’ at (1) has no IMPLICIT type
    born_matrix.f:1237:6:

     1237 | TMP_JAMP(111) = TMP_JAMP(110) + (1) * TMP_JAMP(109) ! used 2 times
          | 1
    Error: Function ‘tmp_jamp’ at (1) has no IMPLICIT type
    born_matrix.f:1237:52:

     1237 | TMP_JAMP(111) = TMP_JAMP(110) + (1) * TMP_JAMP(109) ! used 2 times
          | 1
    Error: Function ‘tmp_jamp’ at (1) has no IMPLICIT type
    born_matrix.f:1238:6:

     1238 | TMP_JAMP(192) = TMP_JAMP(111) + (1) * TMP_JAMP(1) ! used 2 times
          | 1
    Error: Function ‘tmp_jamp’ at (1) has no IMPLICIT type
    born_matrix.f:1238:52:

     1238 | TMP_JAMP(192) = TMP_JAMP(111) + (1) * TMP_JAMP(1) ! used 2 times
          | 1
    Error: Function ‘tmp_jamp’ at (1) has no IMPLICIT type
    born_matrix.f:1239:6:

     1239 | TMP_JAMP(191) = TMP_JAMP(113) + (1) * TMP_JAMP(2) ! used 2 times
          | 1
    Error: Function ‘tmp_jamp’ at (1) has no IMPLICIT type
    born_matrix.f:1239:52:

     1239 | TMP_JAMP(191) = TMP_JAMP(113) + (1) * TMP_JAMP(2) ! used 2 times
          | 1
    Error: Function ‘tmp_jamp’ at (1) has no IMPLICIT type
    born_matrix.f:1240:6:

     1240 | TMP_JAMP(190) = TMP_JAMP(115) + (1) * TMP_JAMP(114) ! used 2 times
          | 1
    Error: Function ‘tmp_jamp’ at (1) has no IMPLICIT type
    born_matrix.f:1240:52:

     1240 | TMP_JAMP(190) = TMP_JAMP(115) + (1) * TMP_JAMP(114) ! used 2 times
          | 1
    Error: Function ‘tmp_jamp’ at (1) has no IMPLICIT type
    born_matrix.f:1241:6:

     1241 | TMP_JAMP(189) = TMP_JAMP(117) + (1) * TMP_JAMP(112) ! used 2 times
          | 1
    Error: Function ‘tmp_jamp’ at (1) has no IMPLICIT type
    born_matrix.f:1241:52:

     1241 | TMP_JAMP(189) = TMP_JAMP(117) + (1) * TMP_JAMP(112) ! used 2 times
          | 1
    Error: Function ‘tmp_jamp’ at (1) has no IMPLICIT type
    born_matrix.f:1242:6:

     1242 | TMP_JAMP(188) = TMP_JAMP(119) + (-1) * TMP_JAMP(118) ! used 2 times
          | 1
    Error: Function ‘tmp_jamp’ at (1) has no IMPLICIT type
    born_matrix.f:1242:53:

     1242 | TMP_JAMP(188) = TMP_JAMP(119) + (-1) * TMP_JAMP(118) ! used 2 times
          | 1
    Error: Function ‘tmp_jamp’ at (1) has no IMPLICIT type
    born_matrix.f:1243:6:

     1243 | TMP_JAMP(187) = TMP_JAMP(121) + (-1) * TMP_JAMP(116) ! used 2 times
          | 1
    Error: Function ‘tmp_jamp’ at (1) has no IMPLICIT type
    born_matrix.f:1243:53:

     1243 | TMP_JAMP(187) = TMP_JAMP(121) + (-1) * TMP_JAMP(116) ! used 2 times
          | 1
    Error: Function ‘tmp_jamp’ at (1) has no IMPLICIT type
    born_matrix.f:1244:6:

     1244 | TMP_JAMP(186) = TMP_JAMP(123) + (1) * TMP_JAMP(122) ! used 2 times
          | 1
    Error: Function ‘tmp_jamp’ at (1) has no IMPLICIT type
    born_matrix.f:1244:52:

     1244 | TMP_JAMP(186) = TMP_JAMP(123) + (1) * TMP_JAMP(122) ! used 2 times
          | 1
    Error: Function ‘tmp_jamp’ at (1) has no IMPLICIT type
    born_matrix.f:1245:6:

     1245 | TMP_JAMP(185) = TMP_JAMP(124) + (1) * TMP_JAMP(120) ! used 2 times
          | 1
    Error: Function ‘tmp_jamp’ at (1) has no IMPLICIT type
    born_matrix.f:1245:52:

     1245 | TMP_JAMP(185) = TMP_JAMP(124) + (1) * TMP_JAMP(120) ! used 2 times
          | 1
    Error: Function ‘tmp_jamp’ at (1) has no IMPLICIT type
    born_matrix.f:1246:6:

     1246 | TMP_JAMP(184) = TMP_JAMP(126) + (1) * TMP_JAMP(125) ! used 2 times
          | 1
    Error: Function ‘tmp_jamp’ at (1) has no IMPLICIT type
    born_matrix.f:1246:52:

     1246 | TMP_JAMP(184) = TMP_JAMP(126) + (1) * TMP_JAMP(125) ! used 2 times
          | 1
    Error: Function ‘tmp_jamp’ at (1) has no IMPLICIT type
    born_matrix.f:1247:6:

     1247 | TMP_JAMP(183) = TMP_JAMP(128) + (1) * TMP_JAMP(127) ! used 2 times
          | 1
    Error: Function ‘tmp_jamp’ at (1) has no IMPLICIT type
    born_matrix.f:1247:52:

     1247 | TMP_JAMP(183) = TMP_JAMP(128) + (1) * TMP_JAMP(127) ! used 2 times
          | 1
    Error: Function ‘tmp_jamp’ at (1) has no IMPLICIT type
    born_matrix.f:1248:6:

     1248 | TMP_JAMP(182) = TMP_JAMP(131) + (1) * TMP_JAMP(130) ! used 2 times
          | 1
    Error: Function ‘tmp_jamp’ at (1) has no IMPLICIT type
    born_matrix.f:1248:52:

     1248 | TMP_JAMP(182) = TMP_JAMP(131) + (1) * TMP_JAMP(130) ! used 2 times
          | 1
    Error: Function ‘tmp_jamp’ at (1) has no IMPLICIT type
    born_matrix.f:1249:6:

     1249 | TMP_JAMP(181) = TMP_JAMP(133) + (1) * TMP_JAMP(129) ! used 2 times
          | 1
    Error: Function ‘tmp_jamp’ at (1) has no IMPLICIT type
    born_matrix.f:1249:52:

     1249 | TMP_JAMP(181) = TMP_JAMP(133) + (1) * TMP_JAMP(129) ! used 2 times
          | 1
    Error: Function ‘tmp_jamp’ at (1) has no IMPLICIT type
    born_matrix.f:1250:6:

     1250 | TMP_JAMP(180) = TMP_JAMP(135) + (1) * TMP_JAMP(134) ! used 2 times
          | 1
    Error: Function ‘tmp_jamp’ at (1) has no IMPLICIT type
    born_matrix.f:1250:52:

     1250 | TMP_JAMP(180) = TMP_JAMP(135) + (1) * TMP_JAMP(134) ! used 2 times
          | 1
    Error: Function ‘tmp_jamp’ at (1) has no IMPLICIT type
    born_matrix.f:1251:6:

     1251 | TMP_JAMP(179) = TMP_JAMP(137) + (1) * TMP_JAMP(136) ! used 2 times
          | 1
    Error: Function ‘tmp_jamp’ at (1) has no IMPLICIT type
    born_matrix.f:1251:52:

     1251 | TMP_JAMP(179) = TMP_JAMP(137) + (1) * TMP_JAMP(136) ! used 2 times
          | 1
    Error: Function ‘tmp_jamp’ at (1) has no IMPLICIT type
    born_matrix.f:1252:6:

     1252 | TMP_JAMP(178) = TMP_JAMP(138) + (1) * TMP_JAMP(132) ! used 2 times
          | 1
    Error: Function ‘tmp_jamp’ at (1) has no IMPLICIT type
    born_matrix.f:1252:52:

     1252 | TMP_JAMP(178) = TMP_JAMP(138) + (1) * TMP_JAMP(132) ! used 2 times
          | 1
    Error: Function ‘tmp_jamp’ at (1) has no IMPLICIT type
    born_matrix.f:1253:6:

     1253 | TMP_JAMP(177) = TMP_JAMP(140) + (1) * TMP_JAMP(139) ! used 2 times
          | 1
    Error: Function ‘tmp_jamp’ at (1) has no IMPLICIT type
    born_matrix.f:1253:52:

     1253 | TMP_JAMP(177) = TMP_JAMP(140) + (1) * TMP_JAMP(139) ! used 2 times
          | 1
    Error: Function ‘tmp_jamp’ at (1) has no IMPLICIT type
    born_matrix.f:1254:6:

     1254 | TMP_JAMP(176) = TMP_JAMP(143) + (1) * TMP_JAMP(142) ! used 2 times
          | 1
    Error: Function ‘tmp_jamp’ at (1) has no IMPLICIT type
    born_matrix.f:1254:52:

     1254 | TMP_JAMP(176) = TMP_JAMP(143) + (1) * TMP_JAMP(142) ! used 2 times
          | 1
    Error: Function ‘tmp_jamp’ at (1) has no IMPLICIT type
    born_matrix.f:1255:6:

     1255 | TMP_JAMP(175) = TMP_JAMP(144) + (1) * TMP_JAMP(141) ! used 2 times
          | 1
    Error: Function ‘tmp_jamp’ at (1) has no IMPLICIT type
    born_matrix.f:1255:52:

     1255 | TMP_JAMP(175) = TMP_JAMP(144) + (1) * TMP_JAMP(141) ! used 2 times
          | 1
    Error: Function ‘tmp_jamp’ at (1) has no IMPLICIT type
    born_matrix.f:1256:6:

     1256 | TMP_JAMP(174) = TMP_JAMP(146) + (1) * TMP_JAMP(145) ! used 2 times
          | 1
    Error: Function ‘tmp_jamp’ at (1) has no IMPLICIT type
    born_matrix.f:1256:52:

     1256 | TMP_JAMP(174) = TMP_JAMP(146) + (1) * TMP_JAMP(145) ! used 2 times
          | 1
    Error: Function ‘tmp_jamp’ at (1) has no IMPLICIT type
    born_matrix.f:1257:6:

     1257 | TMP_JAMP(173) = TMP_JAMP(149) + (1) * TMP_JAMP(148) ! used 2 times
          | 1
    Error: Function ‘tmp_jamp’ at (1) has no IMPLICIT type
    born_matrix.f:1257:52:

     1257 | TMP_JAMP(173) = TMP_JAMP(149) + (1) * TMP_JAMP(148) ! used 2 times
          | 1
    Error: Function ‘tmp_jamp’ at (1) has no IMPLICIT type
    born_matrix.f:1258:6:

     1258 | TMP_JAMP(172) = TMP_JAMP(151) + (1) * TMP_JAMP(150) ! used 2 times
          | 1
    Error: Function ‘tmp_jamp’ at (1) has no IMPLICIT type
    born_matrix.f:1258:52:

     1258 | TMP_JAMP(172) = TMP_JAMP(151) + (1) * TMP_JAMP(150) ! used 2 times
          | 1
    Error: Function ‘tmp_jamp’ at (1) has no IMPLICIT type
    born_matrix.f:1259:6:

     1259 | TMP_JAMP(171) = TMP_JAMP(153) + (1) * TMP_JAMP(152) ! used 2 times
          | 1
    Error: Function ‘tmp_jamp’ at (1) has no IMPLICIT type
    born_matrix.f:1259:52:

     1259 | TMP_JAMP(171) = TMP_JAMP(153) + (1) * TMP_JAMP(152) ! used 2 times
          | 1
    Error: Function ‘tmp_jamp’ at (1) has no IMPLICIT type
    born_matrix.f:1260:6:

     1260 | TMP_JAMP(170) = TMP_JAMP(155) + (1) * TMP_JAMP(147) ! used 2 times
          | 1
    Error: Function ‘tmp_jamp’ at (1) has no IMPLICIT type
    born_matrix.f:1260:52:

     1260 | TMP_JAMP(170) = TMP_JAMP(155) + (1) * TMP_JAMP(147) ! used 2 times
          | 1
    Error: Function ‘tmp_jamp’ at (1) has no IMPLICIT type
    born_matrix.f:1261:6:

     1261 | TMP_JAMP(169) = TMP_JAMP(157) + (1) * TMP_JAMP(156) ! used 2 times
          | 1
    Error: Function ‘tmp_jamp’ at (1) has no IMPLICIT type
    born_matrix.f:1261:52:

     1261 | TMP_JAMP(169) = TMP_JAMP(157) + (1) * TMP_JAMP(156) ! used 2 times
          | 1
    Error: Function ‘tmp_jamp’ at (1) has no IMPLICIT type
    born_matrix.f:1262:6:

     1262 | TMP_JAMP(168) = TMP_JAMP(159) + (1) * TMP_JAMP(158) ! used 2 times
          | 1
    Error: Function ‘tmp_jamp’ at (1) has no IMPLICIT type
    born_matrix.f:1262:52:

     1262 | TMP_JAMP(168) = TMP_JAMP(159) + (1) * TMP_JAMP(158) ! used 2 times
          | 1
    Error: Function ‘tmp_jamp’ at (1) has no IMPLICIT type
    born_matrix.f:1263:6:

     1263 | TMP_JAMP(167) = TMP_JAMP(160) + (1) * TMP_JAMP(154) ! used 2 times
          | 1
    Error: Function ‘tmp_jamp’ at (1) has no IMPLICIT type
    born_matrix.f:1263:52:

     1263 | TMP_JAMP(167) = TMP_JAMP(160) + (1) * TMP_JAMP(154) ! used 2 times
          | 1
    Error: Function ‘tmp_jamp’ at (1) has no IMPLICIT type
    born_matrix.f:1264:6:

     1264 | TMP_JAMP(166) = TMP_JAMP(163) + (1) * TMP_JAMP(162) ! used 2 times
          | 1
    Error: Function ‘tmp_jamp’ at (1) has no IMPLICIT type
    born_matrix.f:1264:52:

     1264 | TMP_JAMP(166) = TMP_JAMP(163) + (1) * TMP_JAMP(162) ! used 2 times
          | 1
    Error: Function ‘tmp_jamp’ at (1) has no IMPLICIT type
    born_matrix.f:1265:6:

     1265 | TMP_JAMP(165) = TMP_JAMP(164) + (1) * TMP_JAMP(161) ! used 2 times
          | 1
    Error: Function ‘tmp_jamp’ at (1) has no IMPLICIT type
    born_matrix.f:1265:52:

     1265 | TMP_JAMP(165) = TMP_JAMP(164) + (1) * TMP_JAMP(161) ! used 2 times
          | 1
    Error: Function ‘tmp_jamp’ at (1) has no IMPLICIT type
    born_matrix.f:1266:6:

     1266 | TMP_JAMP(206) = TMP_JAMP(167) + (1) * TMP_JAMP(165) ! used 2 times
          | 1
    Error: Function ‘tmp_jamp’ at (1) has no IMPLICIT type
    born_matrix.f:1266:52:

     1266 | TMP_JAMP(206) = TMP_JAMP(167) + (1) * TMP_JAMP(165) ! used 2 times
          | 1
    Error: Function ‘tmp_jamp’ at (1) has no IMPLICIT type
    born_matrix.f:1267:6:

     1267 | TMP_JAMP(205) = TMP_JAMP(168) + (1) * TMP_JAMP(166) ! used 2 times
          | 1
    Error: Function ‘tmp_jamp’ at (1) has no IMPLICIT type
    born_matrix.f:1267:52:

     1267 | TMP_JAMP(205) = TMP_JAMP(168) + (1) * TMP_JAMP(166) ! used 2 times
          | 1
    Error: Function ‘tmp_jamp’ at (1) has no IMPLICIT type
    born_matrix.f:1268:6:

     1268 | TMP_JAMP(204) = TMP_JAMP(170) + (1) * TMP_JAMP(169) ! used 2 times
          | 1
    Error: Function ‘tmp_jamp’ at (1) has no IMPLICIT type
    born_matrix.f:1268:52:

     1268 | TMP_JAMP(204) = TMP_JAMP(170) + (1) * TMP_JAMP(169) ! used 2 times
          | 1
    Error: Function ‘tmp_jamp’ at (1) has no IMPLICIT type
    born_matrix.f:1269:6:

     1269 | TMP_JAMP(203) = TMP_JAMP(172) + (1) * TMP_JAMP(171) ! used 2 times
          | 1
    Error: Function ‘tmp_jamp’ at (1) has no IMPLICIT type
    born_matrix.f:1269:52:

     1269 | TMP_JAMP(203) = TMP_JAMP(172) + (1) * TMP_JAMP(171) ! used 2 times
          | 1
    Error: Function ‘tmp_jamp’ at (1) has no IMPLICIT type
    born_matrix.f:1270:6:

     1270 | TMP_JAMP(202) = TMP_JAMP(175) + (1) * TMP_JAMP(174) ! used 2 times
          | 1
    Error: Function ‘tmp_jamp’ at (1) has no IMPLICIT type
    born_matrix.f:1270:52:

     1270 | TMP_JAMP(202) = TMP_JAMP(175) + (1) * TMP_JAMP(174) ! used 2 times
          | 1
    Error: Function ‘tmp_jamp’ at (1) has no IMPLICIT type
    born_matrix.f:1271:6:

     1271 | TMP_JAMP(201) = TMP_JAMP(176) + (1) * TMP_JAMP(173) ! used 2 times
          | 1
    Error: Function ‘tmp_jamp’ at (1) has no IMPLICIT type
    born_matrix.f:1271:52:

     1271 | TMP_JAMP(201) = TMP_JAMP(176) + (1) * TMP_JAMP(173) ! used 2 times
          | 1
    Error: Function ‘tmp_jamp’ at (1) has no IMPLICIT type
    born_matrix.f:1272:6:

     1272 | TMP_JAMP(200) = TMP_JAMP(178) + (1) * TMP_JAMP(177) ! used 2 times
          | 1
    Error: Function ‘tmp_jamp’ at (1) has no IMPLICIT type
    born_matrix.f:1272:52:

     1272 | TMP_JAMP(200) = TMP_JAMP(178) + (1) * TMP_JAMP(177) ! used 2 times
          | 1
    Error: Function ‘tmp_jamp’ at (1) has no IMPLICIT type
    born_matrix.f:1273:6:

     1273 | TMP_JAMP(199) = TMP_JAMP(180) + (1) * TMP_JAMP(179) ! used 2 times
          | 1
    Error: Function ‘tmp_jamp’ at (1) has no IMPLICIT type
    born_matrix.f:1273:52:

     1273 | TMP_JAMP(199) = TMP_JAMP(180) + (1) * TMP_JAMP(179) ! used 2 times
          | 1
    Error: Function ‘tmp_jamp’ at (1) has no IMPLICIT type
    born_matrix.f:1274:6:

     1274 | TMP_JAMP(198) = TMP_JAMP(183) + (1) * TMP_JAMP(181) ! used 2 times
          | 1
    Error: Function ‘tmp_jamp’ at (1) has no IMPLICIT type
    born_matrix.f:1274:52:

     1274 | TMP_JAMP(198) = TMP_JAMP(183) + (1) * TMP_JAMP(181) ! used 2 times
          | 1
    Error: Function ‘tmp_jamp’ at (1) has no IMPLICIT type
    born_matrix.f:1275:6:

     1275 | TMP_JAMP(197) = TMP_JAMP(184) + (1) * TMP_JAMP(182) ! used 2 times
          | 1
    Error: Function ‘tmp_jamp’ at (1) has no IMPLICIT type
    born_matrix.f:1275:52:

     1275 | TMP_JAMP(197) = TMP_JAMP(184) + (1) * TMP_JAMP(182) ! used 2 times
          | 1
    Error: Function ‘tmp_jamp’ at (1) has no IMPLICIT type
    born_matrix.f:1276:6:

     1276 | TMP_JAMP(196) = TMP_JAMP(187) + (1) * TMP_JAMP(186) ! used 2 times
          | 1
    Error: Function ‘tmp_jamp’ at (1) has no IMPLICIT type
    born_matrix.f:1276:52:

     1276 | TMP_JAMP(196) = TMP_JAMP(187) + (1) * TMP_JAMP(186) ! used 2 times
          | 1
    Error: Function ‘tmp_jamp’ at (1) has no IMPLICIT type
    born_matrix.f:1277:6:

     1277 | TMP_JAMP(195) = TMP_JAMP(188) + (1) * TMP_JAMP(185) ! used 2 times
          | 1
    Error: Function ‘tmp_jamp’ at (1) has no IMPLICIT type
    born_matrix.f:1277:52:

     1277 | TMP_JAMP(195) = TMP_JAMP(188) + (1) * TMP_JAMP(185) ! used 2 times
          | 1
    Error: Function ‘tmp_jamp’ at (1) has no IMPLICIT type
    born_matrix.f:1278:6:

     1278 | TMP_JAMP(194) = TMP_JAMP(191) + (1) * TMP_JAMP(190) ! used 2 times
          | 1
    Error: Function ‘tmp_jamp’ at (1) has no IMPLICIT type
    born_matrix.f:1278:52:

     1278 | TMP_JAMP(194) = TMP_JAMP(191) + (1) * TMP_JAMP(190) ! used 2 times
          | 1
    Error: Function ‘tmp_jamp’ at (1) has no IMPLICIT type
    born_matrix.f:1279:6:

     1279 | TMP_JAMP(193) = TMP_JAMP(192) + (1) * TMP_JAMP(189) ! used 2 times
          | 1
    Error: Function ‘tmp_jamp’ at (1) has no IMPLICIT type
    born_matrix.f:1279:52:

     1279 | TMP_JAMP(193) = TMP_JAMP(192) + (1) * TMP_JAMP(189) ! used 2 times
          | 1
    Error: Function ‘tmp_jamp’ at (1) has no IMPLICIT type
    born_matrix.f:1280:6:

     1280 | TMP_JAMP(212) = TMP_JAMP(197) + (1) * TMP_JAMP(195) ! used 2 times
          | 1
    Error: Function ‘tmp_jamp’ at (1) has no IMPLICIT type
    born_matrix.f:1280:52:

     1280 | TMP_JAMP(212) = TMP_JAMP(197) + (1) * TMP_JAMP(195) ! used 2 times
          | 1
    Error: Function ‘tmp_jamp’ at (1) has no IMPLICIT type
    born_matrix.f:1281:6:

     1281 | TMP_JAMP(211) = TMP_JAMP(198) + (1) * TMP_JAMP(196) ! used 2 times
          | 1
    Error: Function ‘tmp_jamp’ at (1) has no IMPLICIT type
    born_matrix.f:1281:52:

     1281 | TMP_JAMP(211) = TMP_JAMP(198) + (1) * TMP_JAMP(196) ! used 2 times
          | 1
    Error: Function ‘tmp_jamp’ at (1) has no IMPLICIT type
    born_matrix.f:1282:6:

     1282 | TMP_JAMP(210) = TMP_JAMP(201) + (-1) * TMP_JAMP(199) ! used 2 times
          | 1
    Error: Function ‘tmp_jamp’ at (1) has no IMPLICIT type
    born_matrix.f:1282:53:

     1282 | TMP_JAMP(210) = TMP_JAMP(201) + (-1) * TMP_JAMP(199) ! used 2 times
          | 1
    Error: Function ‘tmp_jamp’ at (1) has no IMPLICIT type
    born_matrix.f:1283:6:

     1283 | TMP_JAMP(209) = TMP_JAMP(202) + (-1) * TMP_JAMP(200) ! used 2 times
          | 1
    Error: Function ‘tmp_jamp’ at (1) has no IMPLICIT type
    born_matrix.f:1283:53:

     1283 | TMP_JAMP(209) = TMP_JAMP(202) + (-1) * TMP_JAMP(200) ! used 2 times
          | 1
    Error: Function ‘tmp_jamp’ at (1) has no IMPLICIT type
    born_matrix.f:1284:6:

     1284 | TMP_JAMP(208) = TMP_JAMP(205) + (1) * TMP_JAMP(204) ! used 2 times
          | 1
    Error: Function ‘tmp_jamp’ at (1) has no IMPLICIT type
    born_matrix.f:1284:52:

     1284 | TMP_JAMP(208) = TMP_JAMP(205) + (1) * TMP_JAMP(204) ! used 2 times
          | 1
    Error: Function ‘tmp_jamp’ at (1) has no IMPLICIT type
    born_matrix.f:1285:6:

     1285 | TMP_JAMP(207) = TMP_JAMP(206) + (1) * TMP_JAMP(203) ! used 2 times
          | 1
    Error: Function ‘tmp_jamp’ at (1) has no IMPLICIT type
    born_matrix.f:1285:52:

     1285 | TMP_JAMP(207) = TMP_JAMP(206) + (1) * TMP_JAMP(203) ! used 2 times
          | 1
    Error: Function ‘tmp_jamp’ at (1) has no IMPLICIT type
    born_matrix.f:1286:6:

     1286 | TMP_JAMP(216) = TMP_JAMP(207) + (1) * TMP_JAMP(194) ! used 2 times
          | 1
    Error: Function ‘tmp_jamp’ at (1) has no IMPLICIT type
    born_matrix.f:1286:52:

     1286 | TMP_JAMP(216) = TMP_JAMP(207) + (1) * TMP_JAMP(194) ! used 2 times
          | 1
    Error: Function ‘tmp_jamp’ at (1) has no IMPLICIT type
    born_matrix.f:1287:6:

     1287 | TMP_JAMP(215) = TMP_JAMP(208) + (1) * TMP_JAMP(193) ! used 2 times
          | 1
    Error: Function ‘tmp_jamp’ at (1) has no IMPLICIT type
    born_matrix.f:1287:52:

     1287 | TMP_JAMP(215) = TMP_JAMP(208) + (1) * TMP_JAMP(193) ! used 2 times
          | 1
    Error: Function ‘tmp_jamp’ at (1) has no IMPLICIT type
    born_matrix.f:1288:6:

     1288 | TMP_JAMP(214) = TMP_JAMP(211) + (-1) * TMP_JAMP(210) ! used 2 times
          | 1
    Error: Function ‘tmp_jamp’ at (1) has no IMPLICIT type
    born_matrix.f:1288:53:

     1288 | TMP_JAMP(214) = TMP_JAMP(211) + (-1) * TMP_JAMP(210) ! used 2 times
          | 1
    Error: Function ‘tmp_jamp’ at (1) has no IMPLICIT type
    born_matrix.f:1289:6:

     1289 | TMP_JAMP(213) = TMP_JAMP(212) + (-1) * TMP_JAMP(209) ! used 2 times
          | 1
    Error: Function ‘tmp_jamp’ at (1) has no IMPLICIT type
    born_matrix.f:1289:53:

     1289 | TMP_JAMP(213) = TMP_JAMP(212) + (-1) * TMP_JAMP(209) ! used 2 times
          | 1
    Error: Function ‘tmp_jamp’ at (1) has no IMPLICIT type
    born_matrix.f:1290:6:

     1290 | TMP_JAMP(218) = TMP_JAMP(215) + (-1) * TMP_JAMP(213) ! used 2 times
          | 1
    Error: Function ‘tmp_jamp’ at (1) has no IMPLICIT type
    born_matrix.f:1290:53:

     1290 | TMP_JAMP(218) = TMP_JAMP(215) + (-1) * TMP_JAMP(213) ! used 2 times
          | 1
    Error: Function ‘tmp_jamp’ at (1) has no IMPLICIT type
    born_matrix.f:1291:6:

     1291 | TMP_JAMP(217) = TMP_JAMP(216) + (-1) * TMP_JAMP(214) ! used 2 times
          | 1
    Error: Function ‘tmp_jamp’ at (1) has no IMPLICIT type
    born_matrix.f:1291:53:

     1291 | TMP_JAMP(217) = TMP_JAMP(216) + (-1) * TMP_JAMP(214) ! used 2 times
          | 1
    Error: Function ‘tmp_jamp’ at (1) has no IMPLICIT type
    born_matrix.f:1292:60:

     1292 | JAMP(1,1) = (1D0/2D0)*TMP_JAMP(217)+(1D0/6D0)*TMP_JAMP(218)
          | 1
    Error: Function ‘tmp_jamp’ at (1) has no IMPLICIT type
    born_matrix.f:1293:62:

     1293 | JAMP(2,1) = (-1D0/6D0)*TMP_JAMP(217)+(-1D0/2D0)*TMP_JAMP(218)
          | 1
    Error: Function ‘tmp_jamp’ at (1) has no IMPLICIT type
    make[1]: *** [makefile:37: born_matrix.o] Error 1
    make[1]: Leaving directory '/mnt/e/mg5_amc_v2_9_2/ee4bnunu_qcd/SubProcesses/P0_epem_vevexbbbxbx/V0_epem_vevexbbbxbx'
    gfortran -o check_poles parton_lum_1.o parton_lum_chooser.o matrix_1.o real_me_chooser.o leshouche_inc_chooser.o fks_inc_chooser.o setcuts.o setscales.o born.o sborn_sf.o b_sf_003.o b_sf_005.o b_sf_007.o b_sf_006.o b_sf_004.o b_sf_009.o b_sf_002.o b_sf_010.o b_sf_001.o b_sf_008.o fks_Sij.o fastjetfortran_madfks_core.o fjcore.o fastjet_wrapper.o fks_singular.o veto_xsec.o montecarlocounter.o reweight_xsec.o boostwdir2.o configs_and_props_inc_chooser.o initcluster.o cluster.o reweight.o get_color.o FKSParamReader.o iproc_map.o MC_integer.o reweight_xsec_events_pdf_dummy.o appl_interface_dummy.o genps_fks.o weight_lines.o cuts.o pythia_unlops.o recluster.o check_poles.o BinothLHA.o born_hel.o -L../../lib/ libMadLoop.a -lcts -liregi -L/mnt/e/mg5_amc_v2_9_2/HEPTools/lib/ -lninja -L/mnt/e/mg5_amc_v2_9_2/HEPTools/lib/ -lavh_olo -L../../lib/ -ldhelas -lgeneric -lmodel -lpdf -lcernlib -lstdc++ -lstdc++
    gfortran: error: libMadLoop.a: No such file or directory
    make: *** [makefile:100: check_poles] Error 1

Please try to fix this compilations issue and retry.
Help might be found at https://answers.launchpad.net/mg5amcnlo.
If you think that this is a bug, you can report this at https://bugs.launchpad.net/mg5amcnlo
WARNING: Fail to compile the Subprocesses
INFO:
INFO: Checking test output:
INFO: P0_epem_vevexbbbxbx
INFO: Result for test_ME:
INFO: Passed.
INFO: Result for test_MC:
INFO: Passed.
INFO: Result for check_poles:
Command "launch auto " interrupted with error:
FileNotFoundError : [Errno 2] No such file or directory: '/mnt/e/mg5_amc_v2_9_2/ee4bnunu_qcd/SubProcesses/P0_epem_vevexbbbxbx/check_poles.log'
Please report this bug on https://bugs.launchpad.net/mg5amcnlo
More information is found in '/mnt/e/mg5_amc_v2_9_2/ee4bnunu_qcd/run_01_tag_1_debug.log'.
Please attach this file to your report.

Question information

Language:
English Edit question
Status:
Answered
For:
MadGraph5_aMC@NLO Edit question
Assignee:
No assignee Edit question
Last query:
2021-03-22
Last reply:
2021-03-22

Hi,

2.9.3 should be release soon with a fix for that bug.
I believe that this patch in 2.9.3:
https://bazaar.launchpad.net/~maddevelopers/mg5amcnlo/2.9.3/revision/300#madgraph/iolibs/export_v4.py
should be enough (actually only the part concerning
madgraph/iolibs/template_files/matrix_standalone_splitOrders_v4.inc  <https://bazaar.launchpad.net/~maddevelopers/mg5amcnlo/2.9.3/revision/300/madgraph/iolibs/template_files/matrix_standalone_splitOrders_v4.inc>
would be needed.)

Now after that fix, I do have a
>Poles do not cancel, run cannot continue

Which I think makes a lot of sense for such process which mixed QED and QCD (version 3.x should be able to handle mixed expansion.

Cheers,

Olivier

> On 22 Mar 2021, at 18:25, Nikhil Bachhawat <email address hidden> wrote:
>
> New question #696192 on MadGraph5_aMC@NLO:
> https://answers.launchpad.net/mg5amcnlo/+question/696192
>
> Hi,
>
> I am trying to generate events for the process generate e+ e- > neutrino neutrino b b~ b b~ [QCD] where neutrino = vl vl~ .
>
> I have attached the error that I get below. But there seems to be an error when it checks poles.
>
> Can you please help with this?
>
> Thanks,
> Nikhil
>
>
> INFO: Compiling the code
> Lepton-lepton collisions: ignoring PDF related parameters in the run_card.dat (pdlabel, lhaid, reweight_pdf, ...)
> INFO: Compiling source...
> INFO: ...done, continuing with P* directories
> INFO: Compiling directories...
> INFO: Compiling on 64 cores
> INFO: Compiling P0_epem_vevexbbbxbx...
> INFO: Compiling P0_epem_vmvmxbbbxbx...
> WARNING: fct <function compile_dir at 0x7f88c01d0430> does not return 0. Stopping the code in a clean way. The error was:
> A compilation Error occurs when trying to compile /mnt/e/mg5_amc_v2_9_2/ee4bnunu_qcd/SubProcesses/P0_epem_vmvmxbbbxbx.
> The compilation fails with the following output message:
> gfortran -O -fno-automatic -ffixed-line-length-132 -c -I. -I../../lib/ check_poles.f
> check_poles.f:305:132:
>
> 305 | 101 Z(K)=Z(K-1)+PO2LOG-2.*LOG(DFLOAT(K-2))
> | 1
> Warning: Fortran 2018 deleted feature: DO termination statement which is not END DO or CONTINUE with label 101 at (1)
> check_poles.f:307:132:
>
> 307 | 102 Z(K)=(Z(K)-LOG(DFLOAT(K-1)))
> | 1
> Warning: Fortran 2018 deleted feature: DO termination statement which is not END DO or CONTINUE with label 102 at (1)
> check_poles.f:319:132:
>
> 319 | 105 XMT=XMT+ABS(XM(I))
> | 1
> Warning: Fortran 2018 deleted feature: DO termination statement which is not END DO or CONTINUE with label 105 at (1)
> check_poles.f:359:132:
>
> 359 | 202 Q(1,I)=Q(4,I)*S*SIN(F)
> | 1
> Warning: Fortran 2018 deleted feature: DO termination statement which is not END DO or CONTINUE with label 202 at (1)
> check_poles.f:363:132:
>
> 363 | 203 R(I)=0.
> | 1
> Warning: Fortran 2018 deleted feature: DO termination statement which is not END DO or CONTINUE with label 203 at (1)
> check_poles.f:365:132:
>
> 365 | DO 204 K=1,4
> | 1
> Warning: Fortran 2018 deleted feature: Shared DO termination label 204 at (1)
> check_poles.f:366:132:
>
> 366 | 204 R(K)=R(K)+Q(K,I)
> | 1
> Warning: Fortran 2018 deleted feature: DO termination statement which is not END DO or CONTINUE with label 204 at (1)
> check_poles.f:369:132:
>
> 369 | 205 B(K)=-R(K)/RMAS
> | 1
> Warning: Fortran 2018 deleted feature: DO termination statement which is not END DO or CONTINUE with label 205 at (1)
> check_poles.f:378:132:
>
> 378 | 206 P(K,I)=X*(Q(K,I)+B(K)*(Q(4,I)+A*BQ))
> | 1
> Warning: Fortran 2018 deleted feature: DO termination statement which is not END DO or CONTINUE with label 206 at (1)
> check_poles.f:379:132:
>
> 379 | 207 P(0,I)=X*(G*Q(4,I)+BQ)
> | 1
> Warning: Fortran 2018 deleted feature: DO termination statement which is not END DO or CONTINUE with label 207 at (1)
> check_poles.f:401:132:
>
> 401 | 301 P2(I)=P(0,I)**2
> | 1
> Warning: Fortran 2018 deleted feature: DO termination statement which is not END DO or CONTINUE with label 301 at (1)
> check_poles.f:411:132:
>
> 411 | 303 G0=G0+P2(I)/E(I)
> | 1
> Warning: Fortran 2018 deleted feature: DO termination statement which is not END DO or CONTINUE with label 303 at (1)
> check_poles.f:422:132:
>
> 422 | 306 P(K,I)=X*P(K,I)
> | 1
> Warning: Fortran 2018 deleted feature: DO termination statement which is not END DO or CONTINUE with label 306 at (1)
> check_poles.f:423:132:
>
> 423 | 307 P(0,I)=E(I)
> | 1
> Warning: Fortran 2018 deleted feature: DO termination statement which is not END DO or CONTINUE with label 307 at (1)
> check_poles.f:430:132:
>
> 430 | 308 WT3=WT3+V(I)**2/E(I)
> | 1
> Warning: Fortran 2018 deleted feature: DO termination statement which is not END DO or CONTINUE with label 308 at (1)
> run.inc:74:21:
>
> 74 | common/to_rwgt/ do_rwgt_scale, rw_Fscale_down, rw_Fscale_up, rw_Rscale_down, rw_Rscale_up,
> | 1
> Warning: Padding of 4 bytes required before ‘rw_fscale_down’ in COMMON ‘to_rwgt’ at (1); reorder elements or use ‘-fno-align-commons’ [-Walign-commons]
> gfortran -O -fno-automatic -ffixed-line-length-132 -c -I. -I../../lib/ BinothLHA.f
> gfortran -O -fno-automatic -ffixed-line-length-132 -c -I. -I../../lib/ born_hel.f
> for dir in `ls -d V*`; do cd $dir; make; cd ../; done
> make[1]: Entering directory '/mnt/e/mg5_amc_v2_9_2/ee4bnunu_qcd/SubProcesses/P0_epem_vmvmxbbbxbx/V0_epem_vmvmxbbbxbx'
> rm -f ../libMadLoop.a
> gfortran -fno-automatic -ffixed-line-length-132 -O3 -c polynomial.f -o polynomial.o
> gfortran -O -fno-automatic -ffixed-line-length-132 -c loop_matrix.f -I /mnt/e/mg5_amc_v2_9_2/HEPTools/include
> gfortran -O -fno-automatic -ffixed-line-length-132 -c improve_ps.f -I /mnt/e/mg5_amc_v2_9_2/HEPTools/include
> gfortran -O -fno-automatic -ffixed-line-length-132 -c born_matrix.f -I /mnt/e/mg5_amc_v2_9_2/HEPTools/include
> born_matrix.f:891:6:
>
> 891 | TMP_JAMP(68) = AMP(135) + (1) * AMP(136) ! used 2 times
> | 1
> Error: Function ‘tmp_jamp’ at (1) has no IMPLICIT type
> born_matrix.f:892:6:
>
> 892 | TMP_JAMP(67) = AMP(133) + (1) * AMP(134) ! used 2 times
> | 1
> Error: Function ‘tmp_jamp’ at (1) has no IMPLICIT type
> born_matrix.f:893:6:
>
> 893 | TMP_JAMP(66) = AMP(131) + (1) * AMP(132) ! used 2 times
> | 1
> Error: Function ‘tmp_jamp’ at (1) has no IMPLICIT type
> born_matrix.f:894:6:
>
> 894 | TMP_JAMP(65) = AMP(129) + (1) * AMP(130) ! used 2 times
> | 1
> Error: Function ‘tmp_jamp’ at (1) has no IMPLICIT type
> born_matrix.f:895:6:
>
> 895 | TMP_JAMP(64) = AMP(127) + (1) * AMP(128) ! used 2 times
> | 1
> Error: Function ‘tmp_jamp’ at (1) has no IMPLICIT type
> born_matrix.f:896:6:
>
> 896 | TMP_JAMP(63) = AMP(125) + (1) * AMP(126) ! used 2 times
> | 1
> Error: Function ‘tmp_jamp’ at (1) has no IMPLICIT type
> born_matrix.f:897:6:
>
> 897 | TMP_JAMP(62) = AMP(123) + (1) * AMP(124) ! used 2 times
> | 1
> Error: Function ‘tmp_jamp’ at (1) has no IMPLICIT type
> born_matrix.f:898:6:
>
> 898 | TMP_JAMP(61) = AMP(121) + (1) * AMP(122) ! used 2 times
> | 1
> Error: Function ‘tmp_jamp’ at (1) has no IMPLICIT type
> born_matrix.f:899:6:
>
> 899 | TMP_JAMP(60) = AMP(119) + (1) * AMP(120) ! used 2 times
> | 1
> Error: Function ‘tmp_jamp’ at (1) has no IMPLICIT type
> born_matrix.f:900:6:
>
> 900 | TMP_JAMP(59) = AMP(117) + (1) * AMP(118) ! used 2 times
> | 1
> Error: Function ‘tmp_jamp’ at (1) has no IMPLICIT type
> born_matrix.f:901:6:
>
> 901 | TMP_JAMP(58) = AMP(115) + (1) * AMP(116) ! used 2 times
> | 1
> Error: Function ‘tmp_jamp’ at (1) has no IMPLICIT type
> born_matrix.f:902:6:
>
> 902 | TMP_JAMP(57) = AMP(113) + (1) * AMP(114) ! used 2 times
> | 1
> Error: Function ‘tmp_jamp’ at (1) has no IMPLICIT type
> born_matrix.f:903:6:
>
> 903 | TMP_JAMP(56) = AMP(111) + (1) * AMP(112) ! used 2 times
> | 1
> Error: Function ‘tmp_jamp’ at (1) has no IMPLICIT type
> born_matrix.f:904:6:
>
> 904 | TMP_JAMP(55) = AMP(109) + (1) * AMP(110) ! used 2 times
> | 1
> Error: Function ‘tmp_jamp’ at (1) has no IMPLICIT type
> born_matrix.f:905:6:
>
> 905 | TMP_JAMP(54) = AMP(107) + (1) * AMP(108) ! used 2 times
> | 1
> Error: Function ‘tmp_jamp’ at (1) has no IMPLICIT type
> born_matrix.f:906:6:
>
> 906 | TMP_JAMP(53) = AMP(105) + (1) * AMP(106) ! used 2 times
> | 1
> Error: Function ‘tmp_jamp’ at (1) has no IMPLICIT type
> born_matrix.f:907:6:
>
> 907 | TMP_JAMP(52) = AMP(103) + (1) * AMP(104) ! used 2 times
> | 1
> Error: Function ‘tmp_jamp’ at (1) has no IMPLICIT type
> born_matrix.f:908:6:
>
> 908 | TMP_JAMP(51) = AMP(101) + (1) * AMP(102) ! used 2 times
> | 1
> Error: Function ‘tmp_jamp’ at (1) has no IMPLICIT type
> born_matrix.f:909:6:
>
> 909 | TMP_JAMP(50) = AMP(99) + (1) * AMP(100) ! used 2 times
> | 1
> Error: Function ‘tmp_jamp’ at (1) has no IMPLICIT type
> born_matrix.f:910:6:
>
> 910 | TMP_JAMP(49) = AMP(97) + (1) * AMP(98) ! used 2 times
> | 1
> Error: Function ‘tmp_jamp’ at (1) has no IMPLICIT type
> born_matrix.f:911:6:
>
> 911 | TMP_JAMP(48) = AMP(95) + (1) * AMP(96) ! used 2 times
> | 1
> Error: Function ‘tmp_jamp’ at (1) has no IMPLICIT type
> born_matrix.f:912:6:
>
> 912 | TMP_JAMP(47) = AMP(93) + (1) * AMP(94) ! used 2 times
> | 1
> Error: Function ‘tmp_jamp’ at (1) has no IMPLICIT type
> born_matrix.f:913:6:
>
> 913 | TMP_JAMP(46) = AMP(91) + (1) * AMP(92) ! used 2 times
> | 1
> Error: Function ‘tmp_jamp’ at (1) has no IMPLICIT type
> born_matrix.f:914:6:
>
> 914 | TMP_JAMP(45) = AMP(89) + (1) * AMP(90) ! used 2 times
> | 1
> Error: Function ‘tmp_jamp’ at (1) has no IMPLICIT type
> born_matrix.f:915:6:
>
> 915 | TMP_JAMP(44) = AMP(87) + (1) * AMP(88) ! used 2 times
> | 1
> Error: Function ‘tmp_jamp’ at (1) has no IMPLICIT type
> born_matrix.f:916:6:
>
> 916 | TMP_JAMP(43) = AMP(85) + (1) * AMP(86) ! used 2 times
> | 1
> Error: Function ‘tmp_jamp’ at (1) has no IMPLICIT type
> born_matrix.f:917:6:
>
> 917 | TMP_JAMP(42) = AMP(83) + (1) * AMP(84) ! used 2 times
> | 1
> Error: Function ‘tmp_jamp’ at (1) has no IMPLICIT type
> born_matrix.f:918:6:
>
> 918 | TMP_JAMP(41) = AMP(81) + (1) * AMP(82) ! used 2 times
> | 1
> Error: Function ‘tmp_jamp’ at (1) has no IMPLICIT type
> born_matrix.f:919:6:
>
> 919 | TMP_JAMP(40) = AMP(79) + (1) * AMP(80) ! used 2 times
> | 1
> Error: Function ‘tmp_jamp’ at (1) has no IMPLICIT type
> born_matrix.f:920:6:
>
> 920 | TMP_JAMP(39) = AMP(77) + (1) * AMP(78) ! used 2 times
> | 1
> Error: Function ‘tmp_jamp’ at (1) has no IMPLICIT type
> born_matrix.f:921:6:
>
> 921 | TMP_JAMP(38) = AMP(75) + (1) * AMP(76) ! used 2 times
> | 1
> Error: Function ‘tmp_jamp’ at (1) has no IMPLICIT type
> born_matrix.f:922:6:
>
> 922 | TMP_JAMP(37) = AMP(73) + (1) * AMP(74) ! used 2 times
> | 1
> Error: Function ‘tmp_jamp’ at (1) has no IMPLICIT type
> born_matrix.f:923:6:
>
> 923 | TMP_JAMP(36) = AMP(71) + (1) * AMP(72) ! used 2 times
> | 1
> Error: Function ‘tmp_jamp’ at (1) has no IMPLICIT type
> born_matrix.f:924:6:
>
> 924 | TMP_JAMP(35) = AMP(69) + (1) * AMP(70) ! used 2 times
> | 1
> Error: Function ‘tmp_jamp’ at (1) has no IMPLICIT type
> born_matrix.f:925:6:
>
> 925 | TMP_JAMP(34) = AMP(67) + (1) * AMP(68) ! used 2 times
> | 1
> Error: Function ‘tmp_jamp’ at (1) has no IMPLICIT type
> born_matrix.f:926:6:
>
> 926 | TMP_JAMP(33) = AMP(65) + (1) * AMP(66) ! used 2 times
> | 1
> Error: Function ‘tmp_jamp’ at (1) has no IMPLICIT type
> born_matrix.f:927:6:
>
> 927 | TMP_JAMP(32) = AMP(63) + (1) * AMP(64) ! used 2 times
> | 1
> Error: Function ‘tmp_jamp’ at (1) has no IMPLICIT type
> born_matrix.f:928:6:
>
> 928 | TMP_JAMP(31) = AMP(61) + (1) * AMP(62) ! used 2 times
> | 1
> Error: Function ‘tmp_jamp’ at (1) has no IMPLICIT type
> born_matrix.f:929:6:
>
> 929 | TMP_JAMP(30) = AMP(59) + (1) * AMP(60) ! used 2 times
> | 1
> Error: Function ‘tmp_jamp’ at (1) has no IMPLICIT type
> born_matrix.f:930:6:
>
> 930 | TMP_JAMP(29) = AMP(57) + (1) * AMP(58) ! used 2 times
> | 1
> Error: Function ‘tmp_jamp’ at (1) has no IMPLICIT type
> born_matrix.f:931:6:
>
> 931 | TMP_JAMP(28) = AMP(55) + (1) * AMP(56) ! used 2 times
> | 1
> Error: Function ‘tmp_jamp’ at (1) has no IMPLICIT type
> born_matrix.f:932:6:
>
> 932 | TMP_JAMP(27) = AMP(53) + (1) * AMP(54) ! used 2 times
> | 1
> Error: Function ‘tmp_jamp’ at (1) has no IMPLICIT type
> born_matrix.f:933:6:
>
> 933 | TMP_JAMP(26) = AMP(51) + (1) * AMP(52) ! used 2 times
> | 1
> Error: Function ‘tmp_jamp’ at (1) has no IMPLICIT type
> born_matrix.f:934:6:
>
> 934 | TMP_JAMP(25) = AMP(49) + (1) * AMP(50) ! used 2 times
> | 1
> Error: Function ‘tmp_jamp’ at (1) has no IMPLICIT type
> born_matrix.f:935:6:
>
> 935 | TMP_JAMP(24) = AMP(47) + (1) * AMP(48) ! used 2 times
> | 1
> Error: Function ‘tmp_jamp’ at (1) has no IMPLICIT type
> born_matrix.f:936:6:
>
> 936 | TMP_JAMP(23) = AMP(45) + (1) * AMP(46) ! used 2 times
> | 1
> Error: Function ‘tmp_jamp’ at (1) has no IMPLICIT type
> born_matrix.f:937:6:
>
> 937 | TMP_JAMP(22) = AMP(43) + (1) * AMP(44) ! used 2 times
> | 1
> Error: Function ‘tmp_jamp’ at (1) has no IMPLICIT type
> born_matrix.f:938:6:
>
> 938 | TMP_JAMP(21) = AMP(41) + (1) * AMP(42) ! used 2 times
> | 1
> Error: Function ‘tmp_jamp’ at (1) has no IMPLICIT type
> born_matrix.f:939:6:
>
> 939 | TMP_JAMP(20) = AMP(39) + (1) * AMP(40) ! used 2 times
> | 1
> Error: Function ‘tmp_jamp’ at (1) has no IMPLICIT type
> born_matrix.f:940:6:
>
> 940 | TMP_JAMP(19) = AMP(37) + (1) * AMP(38) ! used 2 times
> | 1
> Error: Function ‘tmp_jamp’ at (1) has no IMPLICIT type
> born_matrix.f:941:6:
>
> 941 | TMP_JAMP(18) = AMP(35) + (1) * AMP(36) ! used 2 times
> | 1
> Error: Function ‘tmp_jamp’ at (1) has no IMPLICIT type
> born_matrix.f:942:6:
>
> 942 | TMP_JAMP(17) = AMP(33) + (1) * AMP(34) ! used 2 times
> | 1
> Error: Function ‘tmp_jamp’ at (1) has no IMPLICIT type
> born_matrix.f:943:6:
>
> 943 | TMP_JAMP(16) = AMP(30) + (1) * AMP(31) ! used 2 times
> | 1
> Error: Function ‘tmp_jamp’ at (1) has no IMPLICIT type
> born_matrix.f:944:6:
>
> 944 | TMP_JAMP(15) = AMP(29) + (1) * AMP(32) ! used 2 times
> | 1
> Error: Function ‘tmp_jamp’ at (1) has no IMPLICIT type
> born_matrix.f:945:6:
>
> 945 | TMP_JAMP(14) = AMP(26) + (1) * AMP(27) ! used 2 times
> | 1
> Error: Function ‘tmp_jamp’ at (1) has no IMPLICIT type
> born_matrix.f:946:6:
>
> 946 | TMP_JAMP(13) = AMP(25) + (1) * AMP(28) ! used 2 times
> | 1
> Error: Function ‘tmp_jamp’ at (1) has no IMPLICIT type
> born_matrix.f:947:6:
>
> 947 | TMP_JAMP(12) = AMP(22) + (1) * AMP(23) ! used 2 times
> | 1
> Error: Function ‘tmp_jamp’ at (1) has no IMPLICIT type
> born_matrix.f:948:6:
>
> 948 | TMP_JAMP(11) = AMP(21) + (1) * AMP(24) ! used 2 times
> | 1
> Error: Function ‘tmp_jamp’ at (1) has no IMPLICIT type
> born_matrix.f:949:6:
>
> 949 | TMP_JAMP(10) = AMP(18) + (1) * AMP(19) ! used 2 times
> | 1
> Error: Function ‘tmp_jamp’ at (1) has no IMPLICIT type
> born_matrix.f:950:6:
>
> 950 | TMP_JAMP(9) = AMP(17) + (1) * AMP(20) ! used 2 times
> | 1
> Error: Function ‘tmp_jamp’ at (1) has no IMPLICIT type
> born_matrix.f:951:6:
>
> 951 | TMP_JAMP(8) = AMP(14) + (1) * AMP(15) ! used 2 times
> | 1
> Error: Function ‘tmp_jamp’ at (1) has no IMPLICIT type
> born_matrix.f:952:6:
>
> 952 | TMP_JAMP(7) = AMP(13) + (1) * AMP(16) ! used 2 times
> | 1
> Error: Function ‘tmp_jamp’ at (1) has no IMPLICIT type
> born_matrix.f:953:6:
>
> 953 | TMP_JAMP(6) = AMP(10) + (1) * AMP(11) ! used 2 times
> | 1
> Error: Function ‘tmp_jamp’ at (1) has no IMPLICIT type
> born_matrix.f:954:6:
>
> 954 | TMP_JAMP(5) = AMP(9) + (1) * AMP(12) ! used 2 times
> | 1
> Error: Function ‘tmp_jamp’ at (1) has no IMPLICIT type
> born_matrix.f:955:6:
>
> 955 | TMP_JAMP(4) = AMP(6) + (1) * AMP(7) ! used 2 times
> | 1
> Error: Function ‘tmp_jamp’ at (1) has no IMPLICIT type
> born_matrix.f:956:6:
>
> 956 | TMP_JAMP(3) = AMP(5) + (1) * AMP(8) ! used 2 times
> | 1
> Error: Function ‘tmp_jamp’ at (1) has no IMPLICIT type
> born_matrix.f:957:6:
>
> 957 | TMP_JAMP(2) = AMP(2) + (1) * AMP(3) ! used 2 times
> | 1
> Error: Function ‘tmp_jamp’ at (1) has no IMPLICIT type
> born_matrix.f:958:6:
>
> 958 | TMP_JAMP(1) = AMP(1) + (1) * AMP(4) ! used 2 times
> | 1
> Error: Function ‘tmp_jamp’ at (1) has no IMPLICIT type
> born_matrix.f:959:6:
>
> 959 | TMP_JAMP(102) = TMP_JAMP(3) + (1) * TMP_JAMP(2) ! used 2 times
> | 1
> Error: Function ‘tmp_jamp’ at (1) has no IMPLICIT type
> born_matrix.f:959:50:
>
> 959 | TMP_JAMP(102) = TMP_JAMP(3) + (1) * TMP_JAMP(2) ! used 2 times
> | 1
> Error: Function ‘tmp_jamp’ at (1) has no IMPLICIT type
> born_matrix.f:960:6:
>
> 960 | TMP_JAMP(101) = TMP_JAMP(4) + (1) * TMP_JAMP(1) ! used 2 times
> | 1
> Error: Function ‘tmp_jamp’ at (1) has no IMPLICIT type
> born_matrix.f:960:50:
>
> 960 | TMP_JAMP(101) = TMP_JAMP(4) + (1) * TMP_JAMP(1) ! used 2 times
> | 1
> Error: Function ‘tmp_jamp’ at (1) has no IMPLICIT type
> born_matrix.f:961:6:
>
> 961 | TMP_JAMP(100) = TMP_JAMP(7) + (1) * TMP_JAMP(6) ! used 2 times
> | 1
> Error: Function ‘tmp_jamp’ at (1) has no IMPLICIT type
> born_matrix.f:961:50:
>
> 961 | TMP_JAMP(100) = TMP_JAMP(7) + (1) * TMP_JAMP(6) ! used 2 times
> | 1
> Error: Function ‘tmp_jamp’ at (1) has no IMPLICIT type
> born_matrix.f:962:6:
>
> 962 | TMP_JAMP(99) = TMP_JAMP(8) + (1) * TMP_JAMP(5) ! used 2 times
> | 1
> Error: Function ‘tmp_jamp’ at (1) has no IMPLICIT type
> born_matrix.f:962:49:
>
> 962 | TMP_JAMP(99) = TMP_JAMP(8) + (1) * TMP_JAMP(5) ! used 2 times
> | 1
> Error: Function ‘tmp_jamp’ at (1) has no IMPLICIT type
> born_matrix.f:963:6:
>
> 963 | TMP_JAMP(98) = TMP_JAMP(11) + (1) * TMP_JAMP(10) ! used 2 times
> | 1
> Error: Function ‘tmp_jamp’ at (1) has no IMPLICIT type
> born_matrix.f:963:50:
>
> 963 | TMP_JAMP(98) = TMP_JAMP(11) + (1) * TMP_JAMP(10) ! used 2 times
> | 1
> Error: Function ‘tmp_jamp’ at (1) has no IMPLICIT type
> born_matrix.f:964:6:
>
> 964 | TMP_JAMP(97) = TMP_JAMP(12) + (1) * TMP_JAMP(9) ! used 2 times
> | 1
> Error: Function ‘tmp_jamp’ at (1) has no IMPLICIT type
> born_matrix.f:964:50:
>
> 964 | TMP_JAMP(97) = TMP_JAMP(12) + (1) * TMP_JAMP(9) ! used 2 times
> | 1
> Error: Function ‘tmp_jamp’ at (1) has no IMPLICIT type
> born_matrix.f:965:6:
>
> 965 | TMP_JAMP(96) = TMP_JAMP(15) + (1) * TMP_JAMP(14) ! used 2 times
> | 1
> Error: Function ‘tmp_jamp’ at (1) has no IMPLICIT type
> born_matrix.f:965:50:
>
> 965 | TMP_JAMP(96) = TMP_JAMP(15) + (1) * TMP_JAMP(14) ! used 2 times
> | 1
> Error: Function ‘tmp_jamp’ at (1) has no IMPLICIT type
> born_matrix.f:966:6:
>
> 966 | TMP_JAMP(95) = TMP_JAMP(16) + (1) * TMP_JAMP(13) ! used 2 times
> | 1
> Error: Function ‘tmp_jamp’ at (1) has no IMPLICIT type
> born_matrix.f:966:50:
>
> 966 | TMP_JAMP(95) = TMP_JAMP(16) + (1) * TMP_JAMP(13) ! used 2 times
> | 1
> Error: Function ‘tmp_jamp’ at (1) has no IMPLICIT type
> born_matrix.f:967:6:
>
> 967 | TMP_JAMP(94) = TMP_JAMP(18) + (1) * TMP_JAMP(17) ! used 2 times
> | 1
> Error: Function ‘tmp_jamp’ at (1) has no IMPLICIT type
> born_matrix.f:967:50:
>
> 967 | TMP_JAMP(94) = TMP_JAMP(18) + (1) * TMP_JAMP(17) ! used 2 times
> | 1
> Error: Function ‘tmp_jamp’ at (1) has no IMPLICIT type
> born_matrix.f:968:6:
>
> 968 | TMP_JAMP(93) = TMP_JAMP(20) + (1) * TMP_JAMP(19) ! used 2 times
> | 1
> Error: Function ‘tmp_jamp’ at (1) has no IMPLICIT type
> born_matrix.f:968:50:
>
> 968 | TMP_JAMP(93) = TMP_JAMP(20) + (1) * TMP_JAMP(19) ! used 2 times
> | 1
> Error: Function ‘tmp_jamp’ at (1) has no IMPLICIT type
> born_matrix.f:969:6:
>
> 969 | TMP_JAMP(92) = TMP_JAMP(22) + (1) * TMP_JAMP(21) ! used 2 times
> | 1
> Error: Function ‘tmp_jamp’ at (1) has no IMPLICIT type
> born_matrix.f:969:50:
>
> 969 | TMP_JAMP(92) = TMP_JAMP(22) + (1) * TMP_JAMP(21) ! used 2 times
> | 1
> Error: Function ‘tmp_jamp’ at (1) has no IMPLICIT type
> born_matrix.f:970:6:
>
> 970 | TMP_JAMP(91) = TMP_JAMP(25) + (1) * TMP_JAMP(24) ! used 2 times
> | 1
> Error: Function ‘tmp_jamp’ at (1) has no IMPLICIT type
> born_matrix.f:970:50:
>
> 970 | TMP_JAMP(91) = TMP_JAMP(25) + (1) * TMP_JAMP(24) ! used 2 times
> | 1
> Error: Function ‘tmp_jamp’ at (1) has no IMPLICIT type
> born_matrix.f:971:6:
>
> 971 | TMP_JAMP(90) = TMP_JAMP(27) + (1) * TMP_JAMP(26) ! used 2 times
> | 1
> Error: Function ‘tmp_jamp’ at (1) has no IMPLICIT type
> born_matrix.f:971:50:
>
> 971 | TMP_JAMP(90) = TMP_JAMP(27) + (1) * TMP_JAMP(26) ! used 2 times
> | 1
> Error: Function ‘tmp_jamp’ at (1) has no IMPLICIT type
> born_matrix.f:972:6:
>
> 972 | TMP_JAMP(89) = TMP_JAMP(29) + (1) * TMP_JAMP(28) ! used 2 times
> | 1
> Error: Function ‘tmp_jamp’ at (1) has no IMPLICIT type
> born_matrix.f:972:50:
>
> 972 | TMP_JAMP(89) = TMP_JAMP(29) + (1) * TMP_JAMP(28) ! used 2 times
> | 1
> Error: Function ‘tmp_jamp’ at (1) has no IMPLICIT type
> born_matrix.f:973:6:
>
> 973 | TMP_JAMP(88) = TMP_JAMP(31) + (1) * TMP_JAMP(30) ! used 2 times
> | 1
> Error: Function ‘tmp_jamp’ at (1) has no IMPLICIT type
> born_matrix.f:973:50:
>
> 973 | TMP_JAMP(88) = TMP_JAMP(31) + (1) * TMP_JAMP(30) ! used 2 times
> | 1
> Error: Function ‘tmp_jamp’ at (1) has no IMPLICIT type
> born_matrix.f:974:6:
>
> 974 | TMP_JAMP(87) = TMP_JAMP(33) + (1) * TMP_JAMP(32) ! used 2 times
> | 1
> Error: Function ‘tmp_jamp’ at (1) has no IMPLICIT type
> born_matrix.f:974:50:
>
> 974 | TMP_JAMP(87) = TMP_JAMP(33) + (1) * TMP_JAMP(32) ! used 2 times
> | 1
> Error: Function ‘tmp_jamp’ at (1) has no IMPLICIT type
> born_matrix.f:975:6:
>
> 975 | TMP_JAMP(86) = TMP_JAMP(35) + (1) * TMP_JAMP(34) ! used 2 times
> | 1
> Error: Function ‘tmp_jamp’ at (1) has no IMPLICIT type
> born_matrix.f:975:50:
>
> 975 | TMP_JAMP(86) = TMP_JAMP(35) + (1) * TMP_JAMP(34) ! used 2 times
> | 1
> Error: Function ‘tmp_jamp’ at (1) has no IMPLICIT type
> born_matrix.f:976:6:
>
> 976 | TMP_JAMP(85) = TMP_JAMP(37) + (1) * TMP_JAMP(36) ! used 2 times
> | 1
> Error: Function ‘tmp_jamp’ at (1) has no IMPLICIT type
> born_matrix.f:976:50:
>
> 976 | TMP_JAMP(85) = TMP_JAMP(37) + (1) * TMP_JAMP(36) ! used 2 times
> | 1
> Error: Function ‘tmp_jamp’ at (1) has no IMPLICIT type
> born_matrix.f:977:6:
>
> 977 | TMP_JAMP(84) = TMP_JAMP(38) + (1) * TMP_JAMP(23) ! used 2 times
> | 1
> Error: Function ‘tmp_jamp’ at (1) has no IMPLICIT type
> born_matrix.f:977:50:
>
> 977 | TMP_JAMP(84) = TMP_JAMP(38) + (1) * TMP_JAMP(23) ! used 2 times
> | 1
> Error: Function ‘tmp_jamp’ at (1) has no IMPLICIT type
> born_matrix.f:978:6:
>
> 978 | TMP_JAMP(83) = TMP_JAMP(40) + (1) * TMP_JAMP(39) ! used 2 times
> | 1
> Error: Function ‘tmp_jamp’ at (1) has no IMPLICIT type
> born_matrix.f:978:50:
>
> 978 | TMP_JAMP(83) = TMP_JAMP(40) + (1) * TMP_JAMP(39) ! used 2 times
> | 1
> Error: Function ‘tmp_jamp’ at (1) has no IMPLICIT type
> born_matrix.f:979:6:
>
> 979 | TMP_JAMP(82) = TMP_JAMP(42) + (1) * TMP_JAMP(41) ! used 2 times
> | 1
> Error: Function ‘tmp_jamp’ at (1) has no IMPLICIT type
> born_matrix.f:979:50:
>
> 979 | TMP_JAMP(82) = TMP_JAMP(42) + (1) * TMP_JAMP(41) ! used 2 times
> | 1
> Error: Function ‘tmp_jamp’ at (1) has no IMPLICIT type
> born_matrix.f:980:6:
>
> 980 | TMP_JAMP(81) = TMP_JAMP(44) + (1) * TMP_JAMP(43) ! used 2 times
> | 1
> Error: Function ‘tmp_jamp’ at (1) has no IMPLICIT type
> born_matrix.f:980:50:
>
> 980 | TMP_JAMP(81) = TMP_JAMP(44) + (1) * TMP_JAMP(43) ! used 2 times
> | 1
> Error: Function ‘tmp_jamp’ at (1) has no IMPLICIT type
> born_matrix.f:981:6:
>
> 981 | TMP_JAMP(80) = TMP_JAMP(46) + (1) * TMP_JAMP(45) ! used 2 times
> | 1
> Error: Function ‘tmp_jamp’ at (1) has no IMPLICIT type
> born_matrix.f:981:50:
>
> 981 | TMP_JAMP(80) = TMP_JAMP(46) + (1) * TMP_JAMP(45) ! used 2 times
> | 1
> Error: Function ‘tmp_jamp’ at (1) has no IMPLICIT type
> born_matrix.f:982:6:
>
> 982 | TMP_JAMP(79) = TMP_JAMP(48) + (1) * TMP_JAMP(47) ! used 2 times
> | 1
> Error: Function ‘tmp_jamp’ at (1) has no IMPLICIT type
> born_matrix.f:982:50:
>
> 982 | TMP_JAMP(79) = TMP_JAMP(48) + (1) * TMP_JAMP(47) ! used 2 times
> | 1
> Error: Function ‘tmp_jamp’ at (1) has no IMPLICIT type
> born_matrix.f:983:6:
>
> 983 | TMP_JAMP(78) = TMP_JAMP(50) + (1) * TMP_JAMP(49) ! used 2 times
> | 1
> Error: Function ‘tmp_jamp’ at (1) has no IMPLICIT type
> born_matrix.f:983:50:
>
> 983 | TMP_JAMP(78) = TMP_JAMP(50) + (1) * TMP_JAMP(49) ! used 2 times
> | 1
> Error: Function ‘tmp_jamp’ at (1) has no IMPLICIT type
> born_matrix.f:984:6:
>
> 984 | TMP_JAMP(77) = TMP_JAMP(52) + (1) * TMP_JAMP(51) ! used 2 times
> | 1
> Error: Function ‘tmp_jamp’ at (1) has no IMPLICIT type
> born_matrix.f:984:50:
>
> 984 | TMP_JAMP(77) = TMP_JAMP(52) + (1) * TMP_JAMP(51) ! used 2 times
> | 1
> Error: Function ‘tmp_jamp’ at (1) has no IMPLICIT type
> born_matrix.f:985:6:
>
> 985 | TMP_JAMP(76) = TMP_JAMP(54) + (1) * TMP_JAMP(53) ! used 2 times
> | 1
> Error: Function ‘tmp_jamp’ at (1) has no IMPLICIT type
> born_matrix.f:985:50:
>
> 985 | TMP_JAMP(76) = TMP_JAMP(54) + (1) * TMP_JAMP(53) ! used 2 times
> | 1
> Error: Function ‘tmp_jamp’ at (1) has no IMPLICIT type
> born_matrix.f:986:6:
>
> 986 | TMP_JAMP(75) = TMP_JAMP(56) + (1) * TMP_JAMP(55) ! used 2 times
> | 1
> Error: Function ‘tmp_jamp’ at (1) has no IMPLICIT type
> born_matrix.f:986:50:
>
> 986 | TMP_JAMP(75) = TMP_JAMP(56) + (1) * TMP_JAMP(55) ! used 2 times
> | 1
> Error: Function ‘tmp_jamp’ at (1) has no IMPLICIT type
> born_matrix.f:987:6:
>
> 987 | TMP_JAMP(74) = TMP_JAMP(58) + (1) * TMP_JAMP(57) ! used 2 times
> | 1
> Error: Function ‘tmp_jamp’ at (1) has no IMPLICIT type
> born_matrix.f:987:50:
>
> 987 | TMP_JAMP(74) = TMP_JAMP(58) + (1) * TMP_JAMP(57) ! used 2 times
> | 1
> Error: Function ‘tmp_jamp’ at (1) has no IMPLICIT type
> born_matrix.f:988:6:
>
> 988 | TMP_JAMP(73) = TMP_JAMP(60) + (1) * TMP_JAMP(59) ! used 2 times
> | 1
> Error: Function ‘tmp_jamp’ at (1) has no IMPLICIT type
> born_matrix.f:988:50:
>
> 988 | TMP_JAMP(73) = TMP_JAMP(60) + (1) * TMP_JAMP(59) ! used 2 times
> | 1
> Error: Function ‘tmp_jamp’ at (1) has no IMPLICIT type
> born_matrix.f:989:6:
>
> 989 | TMP_JAMP(72) = TMP_JAMP(62) + (1) * TMP_JAMP(61) ! used 2 times
> | 1
> Error: Function ‘tmp_jamp’ at (1) has no IMPLICIT type
> born_matrix.f:989:50:
>
> 989 | TMP_JAMP(72) = TMP_JAMP(62) + (1) * TMP_JAMP(61) ! used 2 times
> | 1
> Error: Function ‘tmp_jamp’ at (1) has no IMPLICIT type
> born_matrix.f:990:6:
>
> 990 | TMP_JAMP(71) = TMP_JAMP(64) + (1) * TMP_JAMP(63) ! used 2 times
> | 1
> Error: Function ‘tmp_jamp’ at (1) has no IMPLICIT type
> born_matrix.f:990:50:
>
> 990 | TMP_JAMP(71) = TMP_JAMP(64) + (1) * TMP_JAMP(63) ! used 2 times
> | 1
> Error: Function ‘tmp_jamp’ at (1) has no IMPLICIT type
> born_matrix.f:991:6:
>
> 991 | TMP_JAMP(70) = TMP_JAMP(66) + (1) * TMP_JAMP(65) ! used 2 times
> | 1
> Error: Function ‘tmp_jamp’ at (1) has no IMPLICIT type
> born_matrix.f:991:50:
>
> 991 | TMP_JAMP(70) = TMP_JAMP(66) + (1) * TMP_JAMP(65) ! used 2 times
> | 1
> Error: Function ‘tmp_jamp’ at (1) has no IMPLICIT type
> born_matrix.f:992:6:
>
> 992 | TMP_JAMP(69) = TMP_JAMP(68) + (1) * TMP_JAMP(67) ! used 2 times
> | 1
> Error: Function ‘tmp_jamp’ at (1) has no IMPLICIT type
> born_matrix.f:992:50:
>
> 992 | TMP_JAMP(69) = TMP_JAMP(68) + (1) * TMP_JAMP(67) ! used 2 times
> | 1
> Error: Function ‘tmp_jamp’ at (1) has no IMPLICIT type
> born_matrix.f:993:6:
>
> 993 | TMP_JAMP(118) = TMP_JAMP(73) + (1) * TMP_JAMP(72) ! used 2 times
> | 1
> Error: Function ‘tmp_jamp’ at (1) has no IMPLICIT type
> born_matrix.f:993:51:
>
> 993 | TMP_JAMP(118) = TMP_JAMP(73) + (1) * TMP_JAMP(72) ! used 2 times
> | 1
> Error: Function ‘tmp_jamp’ at (1) has no IMPLICIT type
> born_matrix.f:994:6:
>
> 994 | TMP_JAMP(117) = TMP_JAMP(75) + (1) * TMP_JAMP(70) ! used 2 times
> | 1
> Error: Function ‘tmp_jamp’ at (1) has no IMPLICIT type
> born_matrix.f:994:51:
>
> 994 | TMP_JAMP(117) = TMP_JAMP(75) + (1) * TMP_JAMP(70) ! used 2 times
> | 1
> Error: Function ‘tmp_jamp’ at (1) has no IMPLICIT type
> born_matrix.f:995:6:
>
> 995 | TMP_JAMP(116) = TMP_JAMP(77) + (1) * TMP_JAMP(76) ! used 2 times
> | 1
> Error: Function ‘tmp_jamp’ at (1) has no IMPLICIT type
> born_matrix.f:995:51:
>
> 995 | TMP_JAMP(116) = TMP_JAMP(77) + (1) * TMP_JAMP(76) ! used 2 times
> | 1
> Error: Function ‘tmp_jamp’ at (1) has no IMPLICIT type
> born_matrix.f:996:6:
>
> 996 | TMP_JAMP(115) = TMP_JAMP(78) + (1) * TMP_JAMP(74) ! used 2 times
> | 1
> Error: Function ‘tmp_jamp’ at (1) has no IMPLICIT type
> born_matrix.f:996:51:
>
> 996 | TMP_JAMP(115) = TMP_JAMP(78) + (1) * TMP_JAMP(74) ! used 2 times
> | 1
> Error: Function ‘tmp_jamp’ at (1) has no IMPLICIT type
> born_matrix.f:997:6:
>
> 997 | TMP_JAMP(114) = TMP_JAMP(81) + (1) * TMP_JAMP(80) ! used 2 times
> | 1
> Error: Function ‘tmp_jamp’ at (1) has no IMPLICIT type
> born_matrix.f:997:51:
>
> 997 | TMP_JAMP(114) = TMP_JAMP(81) + (1) * TMP_JAMP(80) ! used 2 times
> | 1
> Error: Function ‘tmp_jamp’ at (1) has no IMPLICIT type
> born_matrix.f:998:6:
>
> 998 | TMP_JAMP(113) = TMP_JAMP(83) + (1) * TMP_JAMP(82) ! used 2 times
> | 1
> Error: Function ‘tmp_jamp’ at (1) has no IMPLICIT type
> born_matrix.f:998:51:
>
> 998 | TMP_JAMP(113) = TMP_JAMP(83) + (1) * TMP_JAMP(82) ! used 2 times
> | 1
> Error: Function ‘tmp_jamp’ at (1) has no IMPLICIT type
> born_matrix.f:999:6:
>
> 999 | TMP_JAMP(112) = TMP_JAMP(85) + (1) * TMP_JAMP(79) ! used 2 times
> | 1
> Error: Function ‘tmp_jamp’ at (1) has no IMPLICIT type
> born_matrix.f:999:51:
>
> 999 | TMP_JAMP(112) = TMP_JAMP(85) + (1) * TMP_JAMP(79) ! used 2 times
> | 1
> Error: Function ‘tmp_jamp’ at (1) has no IMPLICIT type
> born_matrix.f:1000:6:
>
> 1000 | TMP_JAMP(111) = TMP_JAMP(87) + (1) * TMP_JAMP(86) ! used 2 times
> | 1
> Error: Function ‘tmp_jamp’ at (1) has no IMPLICIT type
> born_matrix.f:1000:51:
>
> 1000 | TMP_JAMP(111) = TMP_JAMP(87) + (1) * TMP_JAMP(86) ! used 2 times
> | 1
> Error: Function ‘tmp_jamp’ at (1) has no IMPLICIT type
> born_matrix.f:1001:6:
>
> 1001 | TMP_JAMP(110) = TMP_JAMP(89) + (1) * TMP_JAMP(88) ! used 2 times
> | 1
> Error: Function ‘tmp_jamp’ at (1) has no IMPLICIT type
> born_matrix.f:1001:51:
>
> 1001 | TMP_JAMP(110) = TMP_JAMP(89) + (1) * TMP_JAMP(88) ! used 2 times
> | 1
> Error: Function ‘tmp_jamp’ at (1) has no IMPLICIT type
> born_matrix.f:1002:6:
>
> 1002 | TMP_JAMP(109) = TMP_JAMP(91) + (1) * TMP_JAMP(90) ! used 2 times
> | 1
> Error: Function ‘tmp_jamp’ at (1) has no IMPLICIT type
> born_matrix.f:1002:51:
>
> 1002 | TMP_JAMP(109) = TMP_JAMP(91) + (1) * TMP_JAMP(90) ! used 2 times
> | 1
> Error: Function ‘tmp_jamp’ at (1) has no IMPLICIT type
> born_matrix.f:1003:6:
>
> 1003 | TMP_JAMP(108) = TMP_JAMP(92) + (1) * TMP_JAMP(84) ! used 2 times
> | 1
> Error: Function ‘tmp_jamp’ at (1) has no IMPLICIT type
> born_matrix.f:1003:51:
>
> 1003 | TMP_JAMP(108) = TMP_JAMP(92) + (1) * TMP_JAMP(84) ! used 2 times
> | 1
> Error: Function ‘tmp_jamp’ at (1) has no IMPLICIT type
> born_matrix.f:1004:6:
>
> 1004 | TMP_JAMP(107) = TMP_JAMP(94) + (1) * TMP_JAMP(93) ! used 2 times
> | 1
> Error: Function ‘tmp_jamp’ at (1) has no IMPLICIT type
> born_matrix.f:1004:51:
>
> 1004 | TMP_JAMP(107) = TMP_JAMP(94) + (1) * TMP_JAMP(93) ! used 2 times
> | 1
> Error: Function ‘tmp_jamp’ at (1) has no IMPLICIT type
> born_matrix.f:1005:6:
>
> 1005 | TMP_JAMP(106) = TMP_JAMP(97) + (1) * TMP_JAMP(96) ! used 2 times
> | 1
> Error: Function ‘tmp_jamp’ at (1) has no IMPLICIT type
> born_matrix.f:1005:51:
>
> 1005 | TMP_JAMP(106) = TMP_JAMP(97) + (1) * TMP_JAMP(96) ! used 2 times
> | 1
> Error: Function ‘tmp_jamp’ at (1) has no IMPLICIT type
> born_matrix.f:1006:6:
>
> 1006 | TMP_JAMP(105) = TMP_JAMP(98) + (1) * TMP_JAMP(95) ! used 2 times
> | 1
> Error: Function ‘tmp_jamp’ at (1) has no IMPLICIT type
> born_matrix.f:1006:51:
>
> 1006 | TMP_JAMP(105) = TMP_JAMP(98) + (1) * TMP_JAMP(95) ! used 2 times
> | 1
> Error: Function ‘tmp_jamp’ at (1) has no IMPLICIT type
> born_matrix.f:1007:6:
>
> 1007 | TMP_JAMP(104) = TMP_JAMP(101) + (1) * TMP_JAMP(100) ! used 2 times
> | 1
> Error: Function ‘tmp_jamp’ at (1) has no IMPLICIT type
> born_matrix.f:1007:52:
>
> 1007 | TMP_JAMP(104) = TMP_JAMP(101) + (1) * TMP_JAMP(100) ! used 2 times
> | 1
> Error: Function ‘tmp_jamp’ at (1) has no IMPLICIT type
> born_matrix.f:1008:6:
>
> 1008 | TMP_JAMP(103) = TMP_JAMP(102) + (1) * TMP_JAMP(99) ! used 2 times
> | 1
> Error: Function ‘tmp_jamp’ at (1) has no IMPLICIT type
> born_matrix.f:1008:52:
>
> 1008 | TMP_JAMP(103) = TMP_JAMP(102) + (1) * TMP_JAMP(99) ! used 2 times
> | 1
> Error: Function ‘tmp_jamp’ at (1) has no IMPLICIT type
> born_matrix.f:1009:6:
>
> 1009 | TMP_JAMP(126) = TMP_JAMP(105) + (1) * TMP_JAMP(103) ! used 2 times
> | 1
> Error: Function ‘tmp_jamp’ at (1) has no IMPLICIT type
> born_matrix.f:1009:52:
>
> 1009 | TMP_JAMP(126) = TMP_JAMP(105) + (1) * TMP_JAMP(103) ! used 2 times
> | 1
> Error: Function ‘tmp_jamp’ at (1) has no IMPLICIT type
> born_matrix.f:1010:6:
>
> 1010 | TMP_JAMP(125) = TMP_JAMP(106) + (1) * TMP_JAMP(104) ! used 2 times
> | 1
> Error: Function ‘tmp_jamp’ at (1) has no IMPLICIT type
> born_matrix.f:1010:52:
>
> 1010 | TMP_JAMP(125) = TMP_JAMP(106) + (1) * TMP_JAMP(104) ! used 2 times
> | 1
> Error: Function ‘tmp_jamp’ at (1) has no IMPLICIT type
> born_matrix.f:1011:6:
>
> 1011 | TMP_JAMP(124) = TMP_JAMP(108) + (1) * TMP_JAMP(107) ! used 2 times
> | 1
> Error: Function ‘tmp_jamp’ at (1) has no IMPLICIT type
> born_matrix.f:1011:52:
>
> 1011 | TMP_JAMP(124) = TMP_JAMP(108) + (1) * TMP_JAMP(107) ! used 2 times
> | 1
> Error: Function ‘tmp_jamp’ at (1) has no IMPLICIT type
> born_matrix.f:1012:6:
>
> 1012 | TMP_JAMP(123) = TMP_JAMP(110) + (1) * TMP_JAMP(109) ! used 2 times
> | 1
> Error: Function ‘tmp_jamp’ at (1) has no IMPLICIT type
> born_matrix.f:1012:52:
>
> 1012 | TMP_JAMP(123) = TMP_JAMP(110) + (1) * TMP_JAMP(109) ! used 2 times
> | 1
> Error: Function ‘tmp_jamp’ at (1) has no IMPLICIT type
> born_matrix.f:1013:6:
>
> 1013 | TMP_JAMP(122) = TMP_JAMP(112) + (1) * TMP_JAMP(111) ! used 2 times
> | 1
> Error: Function ‘tmp_jamp’ at (1) has no IMPLICIT type
> born_matrix.f:1013:52:
>
> 1013 | TMP_JAMP(122) = TMP_JAMP(112) + (1) * TMP_JAMP(111) ! used 2 times
> | 1
> Error: Function ‘tmp_jamp’ at (1) has no IMPLICIT type
> born_matrix.f:1014:6:
>
> 1014 | TMP_JAMP(121) = TMP_JAMP(114) + (1) * TMP_JAMP(113) ! used 2 times
> | 1
> Error: Function ‘tmp_jamp’ at (1) has no IMPLICIT type
> born_matrix.f:1014:52:
>
> 1014 | TMP_JAMP(121) = TMP_JAMP(114) + (1) * TMP_JAMP(113) ! used 2 times
> | 1
> Error: Function ‘tmp_jamp’ at (1) has no IMPLICIT type
> born_matrix.f:1015:6:
>
> 1015 | TMP_JAMP(120) = TMP_JAMP(117) + (1) * TMP_JAMP(116) ! used 2 times
> | 1
> Error: Function ‘tmp_jamp’ at (1) has no IMPLICIT type
> born_matrix.f:1015:52:
>
> 1015 | TMP_JAMP(120) = TMP_JAMP(117) + (1) * TMP_JAMP(116) ! used 2 times
> | 1
> Error: Function ‘tmp_jamp’ at (1) has no IMPLICIT type
> born_matrix.f:1016:6:
>
> 1016 | TMP_JAMP(119) = TMP_JAMP(118) + (1) * TMP_JAMP(115) ! used 2 times
> | 1
> Error: Function ‘tmp_jamp’ at (1) has no IMPLICIT type
> born_matrix.f:1016:52:
>
> 1016 | TMP_JAMP(119) = TMP_JAMP(118) + (1) * TMP_JAMP(115) ! used 2 times
> | 1
> Error: Function ‘tmp_jamp’ at (1) has no IMPLICIT type
> born_matrix.f:1017:6:
>
> 1017 | TMP_JAMP(130) = TMP_JAMP(121) + (1) * TMP_JAMP(120) ! used 2 times
> | 1
> Error: Function ‘tmp_jamp’ at (1) has no IMPLICIT type
> born_matrix.f:1017:52:
>
> 1017 | TMP_JAMP(130) = TMP_JAMP(121) + (1) * TMP_JAMP(120) ! used 2 times
> | 1
> Error: Function ‘tmp_jamp’ at (1) has no IMPLICIT type
> born_matrix.f:1018:6:
>
> 1018 | TMP_JAMP(129) = TMP_JAMP(122) + (1) * TMP_JAMP(119) ! used 2 times
> | 1
> Error: Function ‘tmp_jamp’ at (1) has no IMPLICIT type
> born_matrix.f:1018:52:
>
> 1018 | TMP_JAMP(129) = TMP_JAMP(122) + (1) * TMP_JAMP(119) ! used 2 times
> | 1
> Error: Function ‘tmp_jamp’ at (1) has no IMPLICIT type
> born_matrix.f:1019:6:
>
> 1019 | TMP_JAMP(128) = TMP_JAMP(125) + (1) * TMP_JAMP(124) ! used 2 times
> | 1
> Error: Function ‘tmp_jamp’ at (1) has no IMPLICIT type
> born_matrix.f:1019:52:
>
> 1019 | TMP_JAMP(128) = TMP_JAMP(125) + (1) * TMP_JAMP(124) ! used 2 times
> | 1
> Error: Function ‘tmp_jamp’ at (1) has no IMPLICIT type
> born_matrix.f:1020:6:
>
> 1020 | TMP_JAMP(127) = TMP_JAMP(126) + (1) * TMP_JAMP(123) ! used 2 times
> | 1
> Error: Function ‘tmp_jamp’ at (1) has no IMPLICIT type
> born_matrix.f:1020:52:
>
> 1020 | TMP_JAMP(127) = TMP_JAMP(126) + (1) * TMP_JAMP(123) ! used 2 times
> | 1
> Error: Function ‘tmp_jamp’ at (1) has no IMPLICIT type
> born_matrix.f:1021:6:
>
> 1021 | TMP_JAMP(132) = TMP_JAMP(129) + (1) * TMP_JAMP(127) ! used 2 times
> | 1
> Error: Function ‘tmp_jamp’ at (1) has no IMPLICIT type
> born_matrix.f:1021:52:
>
> 1021 | TMP_JAMP(132) = TMP_JAMP(129) + (1) * TMP_JAMP(127) ! used 2 times
> | 1
> Error: Function ‘tmp_jamp’ at (1) has no IMPLICIT type
> born_matrix.f:1022:6:
>
> 1022 | TMP_JAMP(131) = TMP_JAMP(130) + (1) * TMP_JAMP(128) ! used 2 times
> | 1
> Error: Function ‘tmp_jamp’ at (1) has no IMPLICIT type
> born_matrix.f:1022:52:
>
> 1022 | TMP_JAMP(131) = TMP_JAMP(130) + (1) * TMP_JAMP(128) ! used 2 times
> | 1
> Error: Function ‘tmp_jamp’ at (1) has no IMPLICIT type
> born_matrix.f:1023:6:
>
> 1023 | TMP_JAMP(134) = TMP_JAMP(131) + (1) * TMP_JAMP(69) ! used 2 times
> | 1
> Error: Function ‘tmp_jamp’ at (1) has no IMPLICIT type
> born_matrix.f:1023:52:
>
> 1023 | TMP_JAMP(134) = TMP_JAMP(131) + (1) * TMP_JAMP(69) ! used 2 times
> | 1
> Error: Function ‘tmp_jamp’ at (1) has no IMPLICIT type
> born_matrix.f:1024:6:
>
> 1024 | TMP_JAMP(133) = TMP_JAMP(132) + (1) * TMP_JAMP(71) ! used 2 times
> | 1
> Error: Function ‘tmp_jamp’ at (1) has no IMPLICIT type
> born_matrix.f:1024:52:
>
> 1024 | TMP_JAMP(133) = TMP_JAMP(132) + (1) * TMP_JAMP(71) ! used 2 times
> | 1
> Error: Function ‘tmp_jamp’ at (1) has no IMPLICIT type
> born_matrix.f:1025:60:
>
> 1025 | JAMP(1,1) = (1D0/2D0)*TMP_JAMP(133)+(1D0/6D0)*TMP_JAMP(134)
> | 1
> Error: Function ‘tmp_jamp’ at (1) has no IMPLICIT type
> born_matrix.f:1026:62:
>
> 1026 | JAMP(2,1) = (-1D0/6D0)*TMP_JAMP(133)+(-1D0/2D0)*TMP_JAMP(134)
> | 1
> Error: Function ‘tmp_jamp’ at (1) has no IMPLICIT type
> make[1]: *** [makefile:37: born_matrix.o] Error 1
> make[1]: Leaving directory '/mnt/e/mg5_amc_v2_9_2/ee4bnunu_qcd/SubProcesses/P0_epem_vmvmxbbbxbx/V0_epem_vmvmxbbbxbx'
> gfortran -o check_poles parton_lum_1.o parton_lum_chooser.o matrix_1.o real_me_chooser.o leshouche_inc_chooser.o fks_inc_chooser.o setcuts.o setscales.o born.o sborn_sf.o b_sf_003.o b_sf_005.o b_sf_007.o b_sf_006.o b_sf_004.o b_sf_009.o b_sf_002.o b_sf_010.o b_sf_001.o b_sf_008.o fks_Sij.o fastjetfortran_madfks_core.o fjcore.o fastjet_wrapper.o fks_singular.o veto_xsec.o montecarlocounter.o reweight_xsec.o boostwdir2.o configs_and_props_inc_chooser.o initcluster.o cluster.o reweight.o get_color.o FKSParamReader.o iproc_map.o MC_integer.o reweight_xsec_events_pdf_dummy.o appl_interface_dummy.o genps_fks.o weight_lines.o cuts.o pythia_unlops.o recluster.o check_poles.o BinothLHA.o born_hel.o -L../../lib/ libMadLoop.a -lcts -liregi -L/mnt/e/mg5_amc_v2_9_2/HEPTools/lib/ -lninja -L/mnt/e/mg5_amc_v2_9_2/HEPTools/lib/ -lavh_olo -L../../lib/ -ldhelas -lgeneric -lmodel -lpdf -lcernlib -lstdc++ -lstdc++
> gfortran: error: libMadLoop.a: No such file or directory
> make: *** [makefile:100: check_poles] Error 1
>
> Please try to fix this compilations issue and retry.
> Help might be found at https://answers.launchpad.net/mg5amcnlo.
> If you think that this is a bug, you can report this at https://bugs.launchpad.net/mg5amcnlo
> WARNING: fct <function compile_dir at 0x7f88c01d0430> does not return 0. Stopping the code in a clean way. The error was:
> A compilation Error occurs when trying to compile /mnt/e/mg5_amc_v2_9_2/ee4bnunu_qcd/SubProcesses/P0_epem_vevexbbbxbx.
> The compilation fails with the following output message:
> gfortran -O -fno-automatic -ffixed-line-length-132 -c -I. -I../../lib/ check_poles.f
> check_poles.f:305:132:
>
> 305 | 101 Z(K)=Z(K-1)+PO2LOG-2.*LOG(DFLOAT(K-2))
> | 1
> Warning: Fortran 2018 deleted feature: DO termination statement which is not END DO or CONTINUE with label 101 at (1)
> check_poles.f:307:132:
>
> 307 | 102 Z(K)=(Z(K)-LOG(DFLOAT(K-1)))
> | 1
> Warning: Fortran 2018 deleted feature: DO termination statement which is not END DO or CONTINUE with label 102 at (1)
> check_poles.f:319:132:
>
> 319 | 105 XMT=XMT+ABS(XM(I))
> | 1
> Warning: Fortran 2018 deleted feature: DO termination statement which is not END DO or CONTINUE with label 105 at (1)
> check_poles.f:359:132:
>
> 359 | 202 Q(1,I)=Q(4,I)*S*SIN(F)
> | 1
> Warning: Fortran 2018 deleted feature: DO termination statement which is not END DO or CONTINUE with label 202 at (1)
> check_poles.f:363:132:
>
> 363 | 203 R(I)=0.
> | 1
> Warning: Fortran 2018 deleted feature: DO termination statement which is not END DO or CONTINUE with label 203 at (1)
> check_poles.f:365:132:
>
> 365 | DO 204 K=1,4
> | 1
> Warning: Fortran 2018 deleted feature: Shared DO termination label 204 at (1)
> check_poles.f:366:132:
>
> 366 | 204 R(K)=R(K)+Q(K,I)
> | 1
> Warning: Fortran 2018 deleted feature: DO termination statement which is not END DO or CONTINUE with label 204 at (1)
> check_poles.f:369:132:
>
> 369 | 205 B(K)=-R(K)/RMAS
> | 1
> Warning: Fortran 2018 deleted feature: DO termination statement which is not END DO or CONTINUE with label 205 at (1)
> check_poles.f:378:132:
>
> 378 | 206 P(K,I)=X*(Q(K,I)+B(K)*(Q(4,I)+A*BQ))
> | 1
> Warning: Fortran 2018 deleted feature: DO termination statement which is not END DO or CONTINUE with label 206 at (1)
> check_poles.f:379:132:
>
> 379 | 207 P(0,I)=X*(G*Q(4,I)+BQ)
> | 1
> Warning: Fortran 2018 deleted feature: DO termination statement which is not END DO or CONTINUE with label 207 at (1)
> check_poles.f:401:132:
>
> 401 | 301 P2(I)=P(0,I)**2
> | 1
> Warning: Fortran 2018 deleted feature: DO termination statement which is not END DO or CONTINUE with label 301 at (1)
> check_poles.f:411:132:
>
> 411 | 303 G0=G0+P2(I)/E(I)
> | 1
> Warning: Fortran 2018 deleted feature: DO termination statement which is not END DO or CONTINUE with label 303 at (1)
> check_poles.f:422:132:
>
> 422 | 306 P(K,I)=X*P(K,I)
> | 1
> Warning: Fortran 2018 deleted feature: DO termination statement which is not END DO or CONTINUE with label 306 at (1)
> check_poles.f:423:132:
>
> 423 | 307 P(0,I)=E(I)
> | 1
> Warning: Fortran 2018 deleted feature: DO termination statement which is not END DO or CONTINUE with label 307 at (1)
> check_poles.f:430:132:
>
> 430 | 308 WT3=WT3+V(I)**2/E(I)
> | 1
> Warning: Fortran 2018 deleted feature: DO termination statement which is not END DO or CONTINUE with label 308 at (1)
> run.inc:74:21:
>
> 74 | common/to_rwgt/ do_rwgt_scale, rw_Fscale_down, rw_Fscale_up, rw_Rscale_down, rw_Rscale_up,
> | 1
> Warning: Padding of 4 bytes required before ‘rw_fscale_down’ in COMMON ‘to_rwgt’ at (1); reorder elements or use ‘-fno-align-commons’ [-Walign-commons]
> gfortran -O -fno-automatic -ffixed-line-length-132 -c -I. -I../../lib/ BinothLHA.f
> gfortran -O -fno-automatic -ffixed-line-length-132 -c -I. -I../../lib/ born_hel.f
> for dir in `ls -d V*`; do cd $dir; make; cd ../; done
> make[1]: Entering directory '/mnt/e/mg5_amc_v2_9_2/ee4bnunu_qcd/SubProcesses/P0_epem_vevexbbbxbx/V0_epem_vevexbbbxbx'
> rm -f ../libMadLoop.a
> gfortran -fno-automatic -ffixed-line-length-132 -O3 -c polynomial.f -o polynomial.o
> gfortran -O -fno-automatic -ffixed-line-length-132 -c loop_matrix.f -I /mnt/e/mg5_amc_v2_9_2/HEPTools/include
> gfortran -O -fno-automatic -ffixed-line-length-132 -c improve_ps.f -I /mnt/e/mg5_amc_v2_9_2/HEPTools/include
> gfortran -O -fno-automatic -ffixed-line-length-132 -c born_matrix.f -I /mnt/e/mg5_amc_v2_9_2/HEPTools/include
> born_matrix.f:1074:6:
>
> 1074 | TMP_JAMP(110) = AMP(219) + (1) * AMP(220) ! used 2 times
> | 1
> Error: Function ‘tmp_jamp’ at (1) has no IMPLICIT type
> born_matrix.f:1075:6:
>
> 1075 | TMP_JAMP(109) = AMP(217) + (1) * AMP(218) ! used 2 times
> | 1
> Error: Function ‘tmp_jamp’ at (1) has no IMPLICIT type
> born_matrix.f:1076:6:
>
> 1076 | TMP_JAMP(108) = AMP(215) + (1) * AMP(216) ! used 2 times
> | 1
> Error: Function ‘tmp_jamp’ at (1) has no IMPLICIT type
> born_matrix.f:1077:6:
>
> 1077 | TMP_JAMP(107) = AMP(213) + (1) * AMP(214) ! used 2 times
> | 1
> Error: Function ‘tmp_jamp’ at (1) has no IMPLICIT type
> born_matrix.f:1078:6:
>
> 1078 | TMP_JAMP(106) = AMP(211) + (1) * AMP(212) ! used 2 times
> | 1
> Error: Function ‘tmp_jamp’ at (1) has no IMPLICIT type
> born_matrix.f:1079:6:
>
> 1079 | TMP_JAMP(105) = AMP(209) + (1) * AMP(210) ! used 2 times
> | 1
> Error: Function ‘tmp_jamp’ at (1) has no IMPLICIT type
> born_matrix.f:1080:6:
>
> 1080 | TMP_JAMP(104) = AMP(207) + (1) * AMP(208) ! used 2 times
> | 1
> Error: Function ‘tmp_jamp’ at (1) has no IMPLICIT type
> born_matrix.f:1081:6:
>
> 1081 | TMP_JAMP(103) = AMP(205) + (1) * AMP(206) ! used 2 times
> | 1
> Error: Function ‘tmp_jamp’ at (1) has no IMPLICIT type
> born_matrix.f:1082:6:
>
> 1082 | TMP_JAMP(102) = AMP(203) + (1) * AMP(204) ! used 2 times
> | 1
> Error: Function ‘tmp_jamp’ at (1) has no IMPLICIT type
> born_matrix.f:1083:6:
>
> 1083 | TMP_JAMP(101) = AMP(201) + (1) * AMP(202) ! used 2 times
> | 1
> Error: Function ‘tmp_jamp’ at (1) has no IMPLICIT type
> born_matrix.f:1084:6:
>
> 1084 | TMP_JAMP(100) = AMP(199) + (1) * AMP(200) ! used 2 times
> | 1
> Error: Function ‘tmp_jamp’ at (1) has no IMPLICIT type
> born_matrix.f:1085:6:
>
> 1085 | TMP_JAMP(99) = AMP(197) + (1) * AMP(198) ! used 2 times
> | 1
> Error: Function ‘tmp_jamp’ at (1) has no IMPLICIT type
> born_matrix.f:1086:6:
>
> 1086 | TMP_JAMP(98) = AMP(195) + (1) * AMP(196) ! used 2 times
> | 1
> Error: Function ‘tmp_jamp’ at (1) has no IMPLICIT type
> born_matrix.f:1087:6:
>
> 1087 | TMP_JAMP(97) = AMP(193) + (1) * AMP(194) ! used 2 times
> | 1
> Error: Function ‘tmp_jamp’ at (1) has no IMPLICIT type
> born_matrix.f:1088:6:
>
> 1088 | TMP_JAMP(96) = AMP(191) + (1) * AMP(192) ! used 2 times
> | 1
> Error: Function ‘tmp_jamp’ at (1) has no IMPLICIT type
> born_matrix.f:1089:6:
>
> 1089 | TMP_JAMP(95) = AMP(189) + (1) * AMP(190) ! used 2 times
> | 1
> Error: Function ‘tmp_jamp’ at (1) has no IMPLICIT type
> born_matrix.f:1090:6:
>
> 1090 | TMP_JAMP(94) = AMP(187) + (1) * AMP(188) ! used 2 times
> | 1
> Error: Function ‘tmp_jamp’ at (1) has no IMPLICIT type
> born_matrix.f:1091:6:
>
> 1091 | TMP_JAMP(93) = AMP(185) + (1) * AMP(186) ! used 2 times
> | 1
> Error: Function ‘tmp_jamp’ at (1) has no IMPLICIT type
> born_matrix.f:1092:6:
>
> 1092 | TMP_JAMP(92) = AMP(183) + (1) * AMP(184) ! used 2 times
> | 1
> Error: Function ‘tmp_jamp’ at (1) has no IMPLICIT type
> born_matrix.f:1093:6:
>
> 1093 | TMP_JAMP(91) = AMP(181) + (1) * AMP(182) ! used 2 times
> | 1
> Error: Function ‘tmp_jamp’ at (1) has no IMPLICIT type
> born_matrix.f:1094:6:
>
> 1094 | TMP_JAMP(90) = AMP(179) + (1) * AMP(180) ! used 2 times
> | 1
> Error: Function ‘tmp_jamp’ at (1) has no IMPLICIT type
> born_matrix.f:1095:6:
>
> 1095 | TMP_JAMP(89) = AMP(177) + (1) * AMP(178) ! used 2 times
> | 1
> Error: Function ‘tmp_jamp’ at (1) has no IMPLICIT type
> born_matrix.f:1096:6:
>
> 1096 | TMP_JAMP(88) = AMP(175) + (1) * AMP(176) ! used 2 times
> | 1
> Error: Function ‘tmp_jamp’ at (1) has no IMPLICIT type
> born_matrix.f:1097:6:
>
> 1097 | TMP_JAMP(87) = AMP(173) + (1) * AMP(174) ! used 2 times
> | 1
> Error: Function ‘tmp_jamp’ at (1) has no IMPLICIT type
> born_matrix.f:1098:6:
>
> 1098 | TMP_JAMP(86) = AMP(171) + (1) * AMP(172) ! used 2 times
> | 1
> Error: Function ‘tmp_jamp’ at (1) has no IMPLICIT type
> born_matrix.f:1099:6:
>
> 1099 | TMP_JAMP(85) = AMP(169) + (1) * AMP(170) ! used 2 times
> | 1
> Error: Function ‘tmp_jamp’ at (1) has no IMPLICIT type
> born_matrix.f:1100:6:
>
> 1100 | TMP_JAMP(84) = AMP(167) + (1) * AMP(168) ! used 2 times
> | 1
> Error: Function ‘tmp_jamp’ at (1) has no IMPLICIT type
> born_matrix.f:1101:6:
>
> 1101 | TMP_JAMP(83) = AMP(165) + (1) * AMP(166) ! used 2 times
> | 1
> Error: Function ‘tmp_jamp’ at (1) has no IMPLICIT type
> born_matrix.f:1102:6:
>
> 1102 | TMP_JAMP(82) = AMP(163) + (1) * AMP(164) ! used 2 times
> | 1
> Error: Function ‘tmp_jamp’ at (1) has no IMPLICIT type
> born_matrix.f:1103:6:
>
> 1103 | TMP_JAMP(81) = AMP(161) + (1) * AMP(162) ! used 2 times
> | 1
> Error: Function ‘tmp_jamp’ at (1) has no IMPLICIT type
> born_matrix.f:1104:6:
>
> 1104 | TMP_JAMP(80) = AMP(159) + (1) * AMP(160) ! used 2 times
> | 1
> Error: Function ‘tmp_jamp’ at (1) has no IMPLICIT type
> born_matrix.f:1105:6:
>
> 1105 | TMP_JAMP(79) = AMP(157) + (1) * AMP(158) ! used 2 times
> | 1
> Error: Function ‘tmp_jamp’ at (1) has no IMPLICIT type
> born_matrix.f:1106:6:
>
> 1106 | TMP_JAMP(78) = AMP(155) + (1) * AMP(156) ! used 2 times
> | 1
> Error: Function ‘tmp_jamp’ at (1) has no IMPLICIT type
> born_matrix.f:1107:6:
>
> 1107 | TMP_JAMP(77) = AMP(153) + (1) * AMP(154) ! used 2 times
> | 1
> Error: Function ‘tmp_jamp’ at (1) has no IMPLICIT type
> born_matrix.f:1108:6:
>
> 1108 | TMP_JAMP(76) = AMP(151) + (1) * AMP(152) ! used 2 times
> | 1
> Error: Function ‘tmp_jamp’ at (1) has no IMPLICIT type
> born_matrix.f:1109:6:
>
> 1109 | TMP_JAMP(75) = AMP(149) + (1) * AMP(150) ! used 2 times
> | 1
> Error: Function ‘tmp_jamp’ at (1) has no IMPLICIT type
> born_matrix.f:1110:6:
>
> 1110 | TMP_JAMP(74) = AMP(147) + (1) * AMP(148) ! used 2 times
> | 1
> Error: Function ‘tmp_jamp’ at (1) has no IMPLICIT type
> born_matrix.f:1111:6:
>
> 1111 | TMP_JAMP(73) = AMP(145) + (1) * AMP(146) ! used 2 times
> | 1
> Error: Function ‘tmp_jamp’ at (1) has no IMPLICIT type
> born_matrix.f:1112:6:
>
> 1112 | TMP_JAMP(72) = AMP(143) + (1) * AMP(144) ! used 2 times
> | 1
> Error: Function ‘tmp_jamp’ at (1) has no IMPLICIT type
> born_matrix.f:1113:6:
>
> 1113 | TMP_JAMP(71) = AMP(141) + (1) * AMP(142) ! used 2 times
> | 1
> Error: Function ‘tmp_jamp’ at (1) has no IMPLICIT type
> born_matrix.f:1114:6:
>
> 1114 | TMP_JAMP(70) = AMP(139) + (1) * AMP(140) ! used 2 times
> | 1
> Error: Function ‘tmp_jamp’ at (1) has no IMPLICIT type
> born_matrix.f:1115:6:
>
> 1115 | TMP_JAMP(69) = AMP(137) + (1) * AMP(138) ! used 2 times
> | 1
> Error: Function ‘tmp_jamp’ at (1) has no IMPLICIT type
> born_matrix.f:1116:6:
>
> 1116 | TMP_JAMP(68) = AMP(135) + (1) * AMP(136) ! used 2 times
> | 1
> Error: Function ‘tmp_jamp’ at (1) has no IMPLICIT type
> born_matrix.f:1117:6:
>
> 1117 | TMP_JAMP(67) = AMP(133) + (1) * AMP(134) ! used 2 times
> | 1
> Error: Function ‘tmp_jamp’ at (1) has no IMPLICIT type
> born_matrix.f:1118:6:
>
> 1118 | TMP_JAMP(66) = AMP(130) + (1) * AMP(131) ! used 2 times
> | 1
> Error: Function ‘tmp_jamp’ at (1) has no IMPLICIT type
> born_matrix.f:1119:6:
>
> 1119 | TMP_JAMP(65) = AMP(128) + (1) * AMP(129) ! used 2 times
> | 1
> Error: Function ‘tmp_jamp’ at (1) has no IMPLICIT type
> born_matrix.f:1120:6:
>
> 1120 | TMP_JAMP(64) = AMP(126) + (1) * AMP(127) ! used 2 times
> | 1
> Error: Function ‘tmp_jamp’ at (1) has no IMPLICIT type
> born_matrix.f:1121:6:
>
> 1121 | TMP_JAMP(63) = AMP(124) + (1) * AMP(125) ! used 2 times
> | 1
> Error: Function ‘tmp_jamp’ at (1) has no IMPLICIT type
> born_matrix.f:1122:6:
>
> 1122 | TMP_JAMP(62) = AMP(122) + (1) * AMP(123) ! used 2 times
> | 1
> Error: Function ‘tmp_jamp’ at (1) has no IMPLICIT type
> born_matrix.f:1123:6:
>
> 1123 | TMP_JAMP(61) = AMP(120) + (1) * AMP(121) ! used 2 times
> | 1
> Error: Function ‘tmp_jamp’ at (1) has no IMPLICIT type
> born_matrix.f:1124:6:
>
> 1124 | TMP_JAMP(60) = AMP(118) + (1) * AMP(119) ! used 2 times
> | 1
> Error: Function ‘tmp_jamp’ at (1) has no IMPLICIT type
> born_matrix.f:1125:6:
>
> 1125 | TMP_JAMP(59) = AMP(116) + (1) * AMP(117) ! used 2 times
> | 1
> Error: Function ‘tmp_jamp’ at (1) has no IMPLICIT type
> born_matrix.f:1126:6:
>
> 1126 | TMP_JAMP(58) = AMP(114) + (1) * AMP(115) ! used 2 times
> | 1
> Error: Function ‘tmp_jamp’ at (1) has no IMPLICIT type
> born_matrix.f:1127:6:
>
> 1127 | TMP_JAMP(57) = AMP(113) + (1) * AMP(132) ! used 2 times
> | 1
> Error: Function ‘tmp_jamp’ at (1) has no IMPLICIT type
> born_matrix.f:1128:6:
>
> 1128 | TMP_JAMP(56) = AMP(111) + (1) * AMP(112) ! used 2 times
> | 1
> Error: Function ‘tmp_jamp’ at (1) has no IMPLICIT type
> born_matrix.f:1129:6:
>
> 1129 | TMP_JAMP(55) = AMP(109) + (1) * AMP(110) ! used 2 times
> | 1
> Error: Function ‘tmp_jamp’ at (1) has no IMPLICIT type
> born_matrix.f:1130:6:
>
> 1130 | TMP_JAMP(54) = AMP(107) + (1) * AMP(108) ! used 2 times
> | 1
> Error: Function ‘tmp_jamp’ at (1) has no IMPLICIT type
> born_matrix.f:1131:6:
>
> 1131 | TMP_JAMP(53) = AMP(105) + (1) * AMP(106) ! used 2 times
> | 1
> Error: Function ‘tmp_jamp’ at (1) has no IMPLICIT type
> born_matrix.f:1132:6:
>
> 1132 | TMP_JAMP(52) = AMP(103) + (1) * AMP(104) ! used 2 times
> | 1
> Error: Function ‘tmp_jamp’ at (1) has no IMPLICIT type
> born_matrix.f:1133:6:
>
> 1133 | TMP_JAMP(51) = AMP(101) + (1) * AMP(102) ! used 2 times
> | 1
> Error: Function ‘tmp_jamp’ at (1) has no IMPLICIT type
> born_matrix.f:1134:6:
>
> 1134 | TMP_JAMP(50) = AMP(99) + (1) * AMP(100) ! used 2 times
> | 1
> Error: Function ‘tmp_jamp’ at (1) has no IMPLICIT type
> born_matrix.f:1135:6:
>
> 1135 | TMP_JAMP(49) = AMP(97) + (1) * AMP(98) ! used 2 times
> | 1
> Error: Function ‘tmp_jamp’ at (1) has no IMPLICIT type
> born_matrix.f:1136:6:
>
> 1136 | TMP_JAMP(48) = AMP(95) + (1) * AMP(96) ! used 2 times
> | 1
> Error: Function ‘tmp_jamp’ at (1) has no IMPLICIT type
> born_matrix.f:1137:6:
>
> 1137 | TMP_JAMP(47) = AMP(93) + (1) * AMP(94) ! used 2 times
> | 1
> Error: Function ‘tmp_jamp’ at (1) has no IMPLICIT type
> born_matrix.f:1138:6:
>
> 1138 | TMP_JAMP(46) = AMP(91) + (1) * AMP(92) ! used 2 times
> | 1
> Error: Function ‘tmp_jamp’ at (1) has no IMPLICIT type
> born_matrix.f:1139:6:
>
> 1139 | TMP_JAMP(45) = AMP(89) + (1) * AMP(90) ! used 2 times
> | 1
> Error: Function ‘tmp_jamp’ at (1) has no IMPLICIT type
> born_matrix.f:1140:6:
>
> 1140 | TMP_JAMP(44) = AMP(87) + (1) * AMP(88) ! used 2 times
> | 1
> Error: Function ‘tmp_jamp’ at (1) has no IMPLICIT type
> born_matrix.f:1141:6:
>
> 1141 | TMP_JAMP(43) = AMP(85) + (1) * AMP(86) ! used 2 times
> | 1
> Error: Function ‘tmp_jamp’ at (1) has no IMPLICIT type
> born_matrix.f:1142:6:
>
> 1142 | TMP_JAMP(42) = AMP(83) + (1) * AMP(84) ! used 2 times
> | 1
> Error: Function ‘tmp_jamp’ at (1) has no IMPLICIT type
> born_matrix.f:1143:6:
>
> 1143 | TMP_JAMP(41) = AMP(81) + (1) * AMP(82) ! used 2 times
> | 1
> Error: Function ‘tmp_jamp’ at (1) has no IMPLICIT type
> born_matrix.f:1144:6:
>
> 1144 | TMP_JAMP(40) = AMP(79) + (1) * AMP(80) ! used 2 times
> | 1
> Error: Function ‘tmp_jamp’ at (1) has no IMPLICIT type
> born_matrix.f:1145:6:
>
> 1145 | TMP_JAMP(39) = AMP(77) + (1) * AMP(78) ! used 2 times
> | 1
> Error: Function ‘tmp_jamp’ at (1) has no IMPLICIT type
> born_matrix.f:1146:6:
>
> 1146 | TMP_JAMP(38) = AMP(75) + (1) * AMP(76) ! used 2 times
> | 1
> Error: Function ‘tmp_jamp’ at (1) has no IMPLICIT type
> born_matrix.f:1147:6:
>
> 1147 | TMP_JAMP(37) = AMP(73) + (1) * AMP(74) ! used 2 times
> | 1
> Error: Function ‘tmp_jamp’ at (1) has no IMPLICIT type
> born_matrix.f:1148:6:
>
> 1148 | TMP_JAMP(36) = AMP(71) + (1) * AMP(72) ! used 2 times
> | 1
> Error: Function ‘tmp_jamp’ at (1) has no IMPLICIT type
> born_matrix.f:1149:6:
>
> 1149 | TMP_JAMP(35) = AMP(69) + (1) * AMP(70) ! used 2 times
> | 1
> Error: Function ‘tmp_jamp’ at (1) has no IMPLICIT type
> born_matrix.f:1150:6:
>
> 1150 | TMP_JAMP(34) = AMP(67) + (1) * AMP(68) ! used 2 times
> | 1
> Error: Function ‘tmp_jamp’ at (1) has no IMPLICIT type
> born_matrix.f:1151:6:
>
> 1151 | TMP_JAMP(33) = AMP(65) + (1) * AMP(66) ! used 2 times
> | 1
> Error: Function ‘tmp_jamp’ at (1) has no IMPLICIT type
> born_matrix.f:1152:6:
>
> 1152 | TMP_JAMP(32) = AMP(63) + (1) * AMP(64) ! used 2 times
> | 1
> Error: Function ‘tmp_jamp’ at (1) has no IMPLICIT type
> born_matrix.f:1153:6:
>
> 1153 | TMP_JAMP(31) = AMP(61) + (1) * AMP(62) ! used 2 times
> | 1
> Error: Function ‘tmp_jamp’ at (1) has no IMPLICIT type
> born_matrix.f:1154:6:
>
> 1154 | TMP_JAMP(30) = AMP(59) + (1) * AMP(60) ! used 2 times
> | 1
> Error: Function ‘tmp_jamp’ at (1) has no IMPLICIT type
> born_matrix.f:1155:6:
>
> 1155 | TMP_JAMP(29) = AMP(57) + (1) * AMP(58) ! used 2 times
> | 1
> Error: Function ‘tmp_jamp’ at (1) has no IMPLICIT type
> born_matrix.f:1156:6:
>
> 1156 | TMP_JAMP(28) = AMP(55) + (1) * AMP(56) ! used 2 times
> | 1
> Error: Function ‘tmp_jamp’ at (1) has no IMPLICIT type
> born_matrix.f:1157:6:
>
> 1157 | TMP_JAMP(27) = AMP(53) + (1) * AMP(54) ! used 2 times
> | 1
> Error: Function ‘tmp_jamp’ at (1) has no IMPLICIT type
> born_matrix.f:1158:6:
>
> 1158 | TMP_JAMP(26) = AMP(51) + (1) * AMP(52) ! used 2 times
> | 1
> Error: Function ‘tmp_jamp’ at (1) has no IMPLICIT type
> born_matrix.f:1159:6:
>
> 1159 | TMP_JAMP(25) = AMP(49) + (1) * AMP(50) ! used 2 times
> | 1
> Error: Function ‘tmp_jamp’ at (1) has no IMPLICIT type
> born_matrix.f:1160:6:
>
> 1160 | TMP_JAMP(24) = AMP(47) + (1) * AMP(48) ! used 2 times
> | 1
> Error: Function ‘tmp_jamp’ at (1) has no IMPLICIT type
> born_matrix.f:1161:6:
>
> 1161 | TMP_JAMP(23) = AMP(45) + (1) * AMP(46) ! used 2 times
> | 1
> Error: Function ‘tmp_jamp’ at (1) has no IMPLICIT type
> born_matrix.f:1162:6:
>
> 1162 | TMP_JAMP(22) = AMP(43) + (1) * AMP(44) ! used 2 times
> | 1
> Error: Function ‘tmp_jamp’ at (1) has no IMPLICIT type
> born_matrix.f:1163:6:
>
> 1163 | TMP_JAMP(21) = AMP(41) + (1) * AMP(42) ! used 2 times
> | 1
> Error: Function ‘tmp_jamp’ at (1) has no IMPLICIT type
> born_matrix.f:1164:6:
>
> 1164 | TMP_JAMP(20) = AMP(39) + (1) * AMP(40) ! used 2 times
> | 1
> Error: Function ‘tmp_jamp’ at (1) has no IMPLICIT type
> born_matrix.f:1165:6:
>
> 1165 | TMP_JAMP(19) = AMP(37) + (1) * AMP(38) ! used 2 times
> | 1
> Error: Function ‘tmp_jamp’ at (1) has no IMPLICIT type
> born_matrix.f:1166:6:
>
> 1166 | TMP_JAMP(18) = AMP(35) + (1) * AMP(36) ! used 2 times
> | 1
> Error: Function ‘tmp_jamp’ at (1) has no IMPLICIT type
> born_matrix.f:1167:6:
>
> 1167 | TMP_JAMP(17) = AMP(33) + (1) * AMP(34) ! used 2 times
> | 1
> Error: Function ‘tmp_jamp’ at (1) has no IMPLICIT type
> born_matrix.f:1168:6:
>
> 1168 | TMP_JAMP(16) = AMP(30) + (1) * AMP(31) ! used 2 times
> | 1
> Error: Function ‘tmp_jamp’ at (1) has no IMPLICIT type
> born_matrix.f:1169:6:
>
> 1169 | TMP_JAMP(15) = AMP(29) + (1) * AMP(32) ! used 2 times
> | 1
> Error: Function ‘tmp_jamp’ at (1) has no IMPLICIT type
> born_matrix.f:1170:6:
>
> 1170 | TMP_JAMP(14) = AMP(26) + (1) * AMP(27) ! used 2 times
> | 1
> Error: Function ‘tmp_jamp’ at (1) has no IMPLICIT type
> born_matrix.f:1171:6:
>
> 1171 | TMP_JAMP(13) = AMP(25) + (1) * AMP(28) ! used 2 times
> | 1
> Error: Function ‘tmp_jamp’ at (1) has no IMPLICIT type
> born_matrix.f:1172:6:
>
> 1172 | TMP_JAMP(12) = AMP(22) + (1) * AMP(23) ! used 2 times
> | 1
> Error: Function ‘tmp_jamp’ at (1) has no IMPLICIT type
> born_matrix.f:1173:6:
>
> 1173 | TMP_JAMP(11) = AMP(21) + (1) * AMP(24) ! used 2 times
> | 1
> Error: Function ‘tmp_jamp’ at (1) has no IMPLICIT type
> born_matrix.f:1174:6:
>
> 1174 | TMP_JAMP(10) = AMP(18) + (1) * AMP(19) ! used 2 times
> | 1
> Error: Function ‘tmp_jamp’ at (1) has no IMPLICIT type
> born_matrix.f:1175:6:
>
> 1175 | TMP_JAMP(9) = AMP(17) + (1) * AMP(20) ! used 2 times
> | 1
> Error: Function ‘tmp_jamp’ at (1) has no IMPLICIT type
> born_matrix.f:1176:6:
>
> 1176 | TMP_JAMP(8) = AMP(14) + (1) * AMP(15) ! used 2 times
> | 1
> Error: Function ‘tmp_jamp’ at (1) has no IMPLICIT type
> born_matrix.f:1177:6:
>
> 1177 | TMP_JAMP(7) = AMP(13) + (1) * AMP(16) ! used 2 times
> | 1
> Error: Function ‘tmp_jamp’ at (1) has no IMPLICIT type
> born_matrix.f:1178:6:
>
> 1178 | TMP_JAMP(6) = AMP(10) + (1) * AMP(11) ! used 2 times
> | 1
> Error: Function ‘tmp_jamp’ at (1) has no IMPLICIT type
> born_matrix.f:1179:6:
>
> 1179 | TMP_JAMP(5) = AMP(9) + (1) * AMP(12) ! used 2 times
> | 1
> Error: Function ‘tmp_jamp’ at (1) has no IMPLICIT type
> born_matrix.f:1180:6:
>
> 1180 | TMP_JAMP(4) = AMP(6) + (1) * AMP(7) ! used 2 times
> | 1
> Error: Function ‘tmp_jamp’ at (1) has no IMPLICIT type
> born_matrix.f:1181:6:
>
> 1181 | TMP_JAMP(3) = AMP(5) + (1) * AMP(8) ! used 2 times
> | 1
> Error: Function ‘tmp_jamp’ at (1) has no IMPLICIT type
> born_matrix.f:1182:6:
>
> 1182 | TMP_JAMP(2) = AMP(2) + (1) * AMP(3) ! used 2 times
> | 1
> Error: Function ‘tmp_jamp’ at (1) has no IMPLICIT type
> born_matrix.f:1183:6:
>
> 1183 | TMP_JAMP(1) = AMP(1) + (1) * AMP(4) ! used 2 times
> | 1
> Error: Function ‘tmp_jamp’ at (1) has no IMPLICIT type
> born_matrix.f:1184:6:
>
> 1184 | TMP_JAMP(164) = TMP_JAMP(5) + (1) * TMP_JAMP(3) ! used 2 times
> | 1
> Error: Function ‘tmp_jamp’ at (1) has no IMPLICIT type
> born_matrix.f:1184:50:
>
> 1184 | TMP_JAMP(164) = TMP_JAMP(5) + (1) * TMP_JAMP(3) ! used 2 times
> | 1
> Error: Function ‘tmp_jamp’ at (1) has no IMPLICIT type
> born_matrix.f:1185:6:
>
> 1185 | TMP_JAMP(163) = TMP_JAMP(6) + (1) * TMP_JAMP(4) ! used 2 times
> | 1
> Error: Function ‘tmp_jamp’ at (1) has no IMPLICIT type
> born_matrix.f:1185:50:
>
> 1185 | TMP_JAMP(163) = TMP_JAMP(6) + (1) * TMP_JAMP(4) ! used 2 times
> | 1
> Error: Function ‘tmp_jamp’ at (1) has no IMPLICIT type
> born_matrix.f:1186:6:
>
> 1186 | TMP_JAMP(162) = TMP_JAMP(9) + (1) * TMP_JAMP(7) ! used 2 times
> | 1
> Error: Function ‘tmp_jamp’ at (1) has no IMPLICIT type
> born_matrix.f:1186:50:
>
> 1186 | TMP_JAMP(162) = TMP_JAMP(9) + (1) * TMP_JAMP(7) ! used 2 times
> | 1
> Error: Function ‘tmp_jamp’ at (1) has no IMPLICIT type
> born_matrix.f:1187:6:
>
> 1187 | TMP_JAMP(161) = TMP_JAMP(10) + (1) * TMP_JAMP(8) ! used 2 times
> | 1
> Error: Function ‘tmp_jamp’ at (1) has no IMPLICIT type
> born_matrix.f:1187:51:
>
> 1187 | TMP_JAMP(161) = TMP_JAMP(10) + (1) * TMP_JAMP(8) ! used 2 times
> | 1
> Error: Function ‘tmp_jamp’ at (1) has no IMPLICIT type
> born_matrix.f:1188:6:
>
> 1188 | TMP_JAMP(160) = TMP_JAMP(13) + (1) * TMP_JAMP(11) ! used 2 times
> | 1
> Error: Function ‘tmp_jamp’ at (1) has no IMPLICIT type
> born_matrix.f:1188:51:
>
> 1188 | TMP_JAMP(160) = TMP_JAMP(13) + (1) * TMP_JAMP(11) ! used 2 times
> | 1
> Error: Function ‘tmp_jamp’ at (1) has no IMPLICIT type
> born_matrix.f:1189:6:
>
> 1189 | TMP_JAMP(159) = TMP_JAMP(14) + (1) * TMP_JAMP(12) ! used 2 times
> | 1
> Error: Function ‘tmp_jamp’ at (1) has no IMPLICIT type
> born_matrix.f:1189:51:
>
> 1189 | TMP_JAMP(159) = TMP_JAMP(14) + (1) * TMP_JAMP(12) ! used 2 times
> | 1
> Error: Function ‘tmp_jamp’ at (1) has no IMPLICIT type
> born_matrix.f:1190:6:
>
> 1190 | TMP_JAMP(158) = TMP_JAMP(17) + (1) * TMP_JAMP(15) ! used 2 times
> | 1
> Error: Function ‘tmp_jamp’ at (1) has no IMPLICIT type
> born_matrix.f:1190:51:
>
> 1190 | TMP_JAMP(158) = TMP_JAMP(17) + (1) * TMP_JAMP(15) ! used 2 times
> | 1
> Error: Function ‘tmp_jamp’ at (1) has no IMPLICIT type
> born_matrix.f:1191:6:
>
> 1191 | TMP_JAMP(157) = TMP_JAMP(19) + (1) * TMP_JAMP(18) ! used 2 times
> | 1
> Error: Function ‘tmp_jamp’ at (1) has no IMPLICIT type
> born_matrix.f:1191:51:
>
> 1191 | TMP_JAMP(157) = TMP_JAMP(19) + (1) * TMP_JAMP(18) ! used 2 times
> | 1
> Error: Function ‘tmp_jamp’ at (1) has no IMPLICIT type
> born_matrix.f:1192:6:
>
> 1192 | TMP_JAMP(156) = TMP_JAMP(21) + (1) * TMP_JAMP(20) ! used 2 times
> | 1
> Error: Function ‘tmp_jamp’ at (1) has no IMPLICIT type
> born_matrix.f:1192:51:
>
> 1192 | TMP_JAMP(156) = TMP_JAMP(21) + (1) * TMP_JAMP(20) ! used 2 times
> | 1
> Error: Function ‘tmp_jamp’ at (1) has no IMPLICIT type
> born_matrix.f:1193:6:
>
> 1193 | TMP_JAMP(155) = TMP_JAMP(23) + (1) * TMP_JAMP(22) ! used 2 times
> | 1
> Error: Function ‘tmp_jamp’ at (1) has no IMPLICIT type
> born_matrix.f:1193:51:
>
> 1193 | TMP_JAMP(155) = TMP_JAMP(23) + (1) * TMP_JAMP(22) ! used 2 times
> | 1
> Error: Function ‘tmp_jamp’ at (1) has no IMPLICIT type
> born_matrix.f:1194:6:
>
> 1194 | TMP_JAMP(154) = TMP_JAMP(24) + (1) * TMP_JAMP(16) ! used 2 times
> | 1
> Error: Function ‘tmp_jamp’ at (1) has no IMPLICIT type
> born_matrix.f:1194:51:
>
> 1194 | TMP_JAMP(154) = TMP_JAMP(24) + (1) * TMP_JAMP(16) ! used 2 times
> | 1
> Error: Function ‘tmp_jamp’ at (1) has no IMPLICIT type
> born_matrix.f:1195:6:
>
> 1195 | TMP_JAMP(153) = TMP_JAMP(26) + (1) * TMP_JAMP(25) ! used 2 times
> | 1
> Error: Function ‘tmp_jamp’ at (1) has no IMPLICIT type
> born_matrix.f:1195:51:
>
> 1195 | TMP_JAMP(153) = TMP_JAMP(26) + (1) * TMP_JAMP(25) ! used 2 times
> | 1
> Error: Function ‘tmp_jamp’ at (1) has no IMPLICIT type
> born_matrix.f:1196:6:
>
> 1196 | TMP_JAMP(152) = TMP_JAMP(28) + (1) * TMP_JAMP(27) ! used 2 times
> | 1
> Error: Function ‘tmp_jamp’ at (1) has no IMPLICIT type
> born_matrix.f:1196:51:
>
> 1196 | TMP_JAMP(152) = TMP_JAMP(28) + (1) * TMP_JAMP(27) ! used 2 times
> | 1
> Error: Function ‘tmp_jamp’ at (1) has no IMPLICIT type
> born_matrix.f:1197:6:
>
> 1197 | TMP_JAMP(151) = TMP_JAMP(30) + (1) * TMP_JAMP(29) ! used 2 times
> | 1
> Error: Function ‘tmp_jamp’ at (1) has no IMPLICIT type
> born_matrix.f:1197:51:
>
> 1197 | TMP_JAMP(151) = TMP_JAMP(30) + (1) * TMP_JAMP(29) ! used 2 times
> | 1
> Error: Function ‘tmp_jamp’ at (1) has no IMPLICIT type
> born_matrix.f:1198:6:
>
> 1198 | TMP_JAMP(150) = TMP_JAMP(32) + (1) * TMP_JAMP(31) ! used 2 times
> | 1
> Error: Function ‘tmp_jamp’ at (1) has no IMPLICIT type
> born_matrix.f:1198:51:
>
> 1198 | TMP_JAMP(150) = TMP_JAMP(32) + (1) * TMP_JAMP(31) ! used 2 times
> | 1
> Error: Function ‘tmp_jamp’ at (1) has no IMPLICIT type
> born_matrix.f:1199:6:
>
> 1199 | TMP_JAMP(149) = TMP_JAMP(34) + (1) * TMP_JAMP(33) ! used 2 times
> | 1
> Error: Function ‘tmp_jamp’ at (1) has no IMPLICIT type
> born_matrix.f:1199:51:
>
> 1199 | TMP_JAMP(149) = TMP_JAMP(34) + (1) * TMP_JAMP(33) ! used 2 times
> | 1
> Error: Function ‘tmp_jamp’ at (1) has no IMPLICIT type
> born_matrix.f:1200:6:
>
> 1200 | TMP_JAMP(148) = TMP_JAMP(36) + (1) * TMP_JAMP(35) ! used 2 times
> | 1
> Error: Function ‘tmp_jamp’ at (1) has no IMPLICIT type
> born_matrix.f:1200:51:
>
> 1200 | TMP_JAMP(148) = TMP_JAMP(36) + (1) * TMP_JAMP(35) ! used 2 times
> | 1
> Error: Function ‘tmp_jamp’ at (1) has no IMPLICIT type
> born_matrix.f:1201:6:
>
> 1201 | TMP_JAMP(147) = TMP_JAMP(39) + (1) * TMP_JAMP(38) ! used 2 times
> | 1
> Error: Function ‘tmp_jamp’ at (1) has no IMPLICIT type
> born_matrix.f:1201:51:
>
> 1201 | TMP_JAMP(147) = TMP_JAMP(39) + (1) * TMP_JAMP(38) ! used 2 times
> | 1
> Error: Function ‘tmp_jamp’ at (1) has no IMPLICIT type
> born_matrix.f:1202:6:
>
> 1202 | TMP_JAMP(146) = TMP_JAMP(41) + (1) * TMP_JAMP(40) ! used 2 times
> | 1
> Error: Function ‘tmp_jamp’ at (1) has no IMPLICIT type
> born_matrix.f:1202:51:
>
> 1202 | TMP_JAMP(146) = TMP_JAMP(41) + (1) * TMP_JAMP(40) ! used 2 times
> | 1
> Error: Function ‘tmp_jamp’ at (1) has no IMPLICIT type
> born_matrix.f:1203:6:
>
> 1203 | TMP_JAMP(145) = TMP_JAMP(43) + (1) * TMP_JAMP(42) ! used 2 times
> | 1
> Error: Function ‘tmp_jamp’ at (1) has no IMPLICIT type
> born_matrix.f:1203:51:
>
> 1203 | TMP_JAMP(145) = TMP_JAMP(43) + (1) * TMP_JAMP(42) ! used 2 times
> | 1
> Error: Function ‘tmp_jamp’ at (1) has no IMPLICIT type
> born_matrix.f:1204:6:
>
> 1204 | TMP_JAMP(144) = TMP_JAMP(45) + (1) * TMP_JAMP(44) ! used 2 times
> | 1
> Error: Function ‘tmp_jamp’ at (1) has no IMPLICIT type
> born_matrix.f:1204:51:
>
> 1204 | TMP_JAMP(144) = TMP_JAMP(45) + (1) * TMP_JAMP(44) ! used 2 times
> | 1
> Error: Function ‘tmp_jamp’ at (1) has no IMPLICIT type
> born_matrix.f:1205:6:
>
> 1205 | TMP_JAMP(143) = TMP_JAMP(47) + (1) * TMP_JAMP(37) ! used 2 times
> | 1
> Error: Function ‘tmp_jamp’ at (1) has no IMPLICIT type
> born_matrix.f:1205:51:
>
> 1205 | TMP_JAMP(143) = TMP_JAMP(47) + (1) * TMP_JAMP(37) ! used 2 times
> | 1
> Error: Function ‘tmp_jamp’ at (1) has no IMPLICIT type
> born_matrix.f:1206:6:
>
> 1206 | TMP_JAMP(142) = TMP_JAMP(49) + (1) * TMP_JAMP(48) ! used 2 times
> | 1
> Error: Function ‘tmp_jamp’ at (1) has no IMPLICIT type
> born_matrix.f:1206:51:
>
> 1206 | TMP_JAMP(142) = TMP_JAMP(49) + (1) * TMP_JAMP(48) ! used 2 times
> | 1
> Error: Function ‘tmp_jamp’ at (1) has no IMPLICIT type
> born_matrix.f:1207:6:
>
> 1207 | TMP_JAMP(141) = TMP_JAMP(51) + (1) * TMP_JAMP(46) ! used 2 times
> | 1
> Error: Function ‘tmp_jamp’ at (1) has no IMPLICIT type
> born_matrix.f:1207:51:
>
> 1207 | TMP_JAMP(141) = TMP_JAMP(51) + (1) * TMP_JAMP(46) ! used 2 times
> | 1
> Error: Function ‘tmp_jamp’ at (1) has no IMPLICIT type
> born_matrix.f:1208:6:
>
> 1208 | TMP_JAMP(140) = TMP_JAMP(53) + (-1) * TMP_JAMP(52) ! used 2 times
> | 1
> Error: Function ‘tmp_jamp’ at (1) has no IMPLICIT type
> born_matrix.f:1208:52:
>
> 1208 | TMP_JAMP(140) = TMP_JAMP(53) + (-1) * TMP_JAMP(52) ! used 2 times
> | 1
> Error: Function ‘tmp_jamp’ at (1) has no IMPLICIT type
> born_matrix.f:1209:6:
>
> 1209 | TMP_JAMP(139) = TMP_JAMP(55) + (1) * TMP_JAMP(54) ! used 2 times
> | 1
> Error: Function ‘tmp_jamp’ at (1) has no IMPLICIT type
> born_matrix.f:1209:51:
>
> 1209 | TMP_JAMP(139) = TMP_JAMP(55) + (1) * TMP_JAMP(54) ! used 2 times
> | 1
> Error: Function ‘tmp_jamp’ at (1) has no IMPLICIT type
> born_matrix.f:1210:6:
>
> 1210 | TMP_JAMP(138) = TMP_JAMP(57) + (1) * TMP_JAMP(56) ! used 2 times
> | 1
> Error: Function ‘tmp_jamp’ at (1) has no IMPLICIT type
> born_matrix.f:1210:51:
>
> 1210 | TMP_JAMP(138) = TMP_JAMP(57) + (1) * TMP_JAMP(56) ! used 2 times
> | 1
> Error: Function ‘tmp_jamp’ at (1) has no IMPLICIT type
> born_matrix.f:1211:6:
>
> 1211 | TMP_JAMP(137) = TMP_JAMP(58) + (-1) * TMP_JAMP(50) ! used 2 times
> | 1
> Error: Function ‘tmp_jamp’ at (1) has no IMPLICIT type
> born_matrix.f:1211:52:
>
> 1211 | TMP_JAMP(137) = TMP_JAMP(58) + (-1) * TMP_JAMP(50) ! used 2 times
> | 1
> Error: Function ‘tmp_jamp’ at (1) has no IMPLICIT type
> born_matrix.f:1212:6:
>
> 1212 | TMP_JAMP(136) = TMP_JAMP(60) + (1) * TMP_JAMP(59) ! used 2 times
> | 1
> Error: Function ‘tmp_jamp’ at (1) has no IMPLICIT type
> born_matrix.f:1212:51:
>
> 1212 | TMP_JAMP(136) = TMP_JAMP(60) + (1) * TMP_JAMP(59) ! used 2 times
> | 1
> Error: Function ‘tmp_jamp’ at (1) has no IMPLICIT type
> born_matrix.f:1213:6:
>
> 1213 | TMP_JAMP(135) = TMP_JAMP(62) + (1) * TMP_JAMP(61) ! used 2 times
> | 1
> Error: Function ‘tmp_jamp’ at (1) has no IMPLICIT type
> born_matrix.f:1213:51:
>
> 1213 | TMP_JAMP(135) = TMP_JAMP(62) + (1) * TMP_JAMP(61) ! used 2 times
> | 1
> Error: Function ‘tmp_jamp’ at (1) has no IMPLICIT type
> born_matrix.f:1214:6:
>
> 1214 | TMP_JAMP(134) = TMP_JAMP(64) + (1) * TMP_JAMP(63) ! used 2 times
> | 1
> Error: Function ‘tmp_jamp’ at (1) has no IMPLICIT type
> born_matrix.f:1214:51:
>
> 1214 | TMP_JAMP(134) = TMP_JAMP(64) + (1) * TMP_JAMP(63) ! used 2 times
> | 1
> Error: Function ‘tmp_jamp’ at (1) has no IMPLICIT type
> born_matrix.f:1215:6:
>
> 1215 | TMP_JAMP(133) = TMP_JAMP(66) + (1) * TMP_JAMP(65) ! used 2 times
> | 1
> Error: Function ‘tmp_jamp’ at (1) has no IMPLICIT type
> born_matrix.f:1215:51:
>
> 1215 | TMP_JAMP(133) = TMP_JAMP(66) + (1) * TMP_JAMP(65) ! used 2 times
> | 1
> Error: Function ‘tmp_jamp’ at (1) has no IMPLICIT type
> born_matrix.f:1216:6:
>
> 1216 | TMP_JAMP(132) = TMP_JAMP(68) + (1) * TMP_JAMP(67) ! used 2 times
> | 1
> Error: Function ‘tmp_jamp’ at (1) has no IMPLICIT type
> born_matrix.f:1216:51:
>
> 1216 | TMP_JAMP(132) = TMP_JAMP(68) + (1) * TMP_JAMP(67) ! used 2 times
> | 1
> Error: Function ‘tmp_jamp’ at (1) has no IMPLICIT type
> born_matrix.f:1217:6:
>
> 1217 | TMP_JAMP(131) = TMP_JAMP(70) + (1) * TMP_JAMP(69) ! used 2 times
> | 1
> Error: Function ‘tmp_jamp’ at (1) has no IMPLICIT type
> born_matrix.f:1217:51:
>
> 1217 | TMP_JAMP(131) = TMP_JAMP(70) + (1) * TMP_JAMP(69) ! used 2 times
> | 1
> Error: Function ‘tmp_jamp’ at (1) has no IMPLICIT type
> born_matrix.f:1218:6:
>
> 1218 | TMP_JAMP(130) = TMP_JAMP(72) + (1) * TMP_JAMP(71) ! used 2 times
> | 1
> Error: Function ‘tmp_jamp’ at (1) has no IMPLICIT type
> born_matrix.f:1218:51:
>
> 1218 | TMP_JAMP(130) = TMP_JAMP(72) + (1) * TMP_JAMP(71) ! used 2 times
> | 1
> Error: Function ‘tmp_jamp’ at (1) has no IMPLICIT type
> born_matrix.f:1219:6:
>
> 1219 | TMP_JAMP(129) = TMP_JAMP(75) + (1) * TMP_JAMP(74) ! used 2 times
> | 1
> Error: Function ‘tmp_jamp’ at (1) has no IMPLICIT type
> born_matrix.f:1219:51:
>
> 1219 | TMP_JAMP(129) = TMP_JAMP(75) + (1) * TMP_JAMP(74) ! used 2 times
> | 1
> Error: Function ‘tmp_jamp’ at (1) has no IMPLICIT type
> born_matrix.f:1220:6:
>
> 1220 | TMP_JAMP(128) = TMP_JAMP(77) + (1) * TMP_JAMP(76) ! used 2 times
> | 1
> Error: Function ‘tmp_jamp’ at (1) has no IMPLICIT type
> born_matrix.f:1220:51:
>
> 1220 | TMP_JAMP(128) = TMP_JAMP(77) + (1) * TMP_JAMP(76) ! used 2 times
> | 1
> Error: Function ‘tmp_jamp’ at (1) has no IMPLICIT type
> born_matrix.f:1221:6:
>
> 1221 | TMP_JAMP(127) = TMP_JAMP(79) + (1) * TMP_JAMP(78) ! used 2 times
> | 1
> Error: Function ‘tmp_jamp’ at (1) has no IMPLICIT type
> born_matrix.f:1221:51:
>
> 1221 | TMP_JAMP(127) = TMP_JAMP(79) + (1) * TMP_JAMP(78) ! used 2 times
> | 1
> Error: Function ‘tmp_jamp’ at (1) has no IMPLICIT type
> born_matrix.f:1222:6:
>
> 1222 | TMP_JAMP(126) = TMP_JAMP(80) + (1) * TMP_JAMP(73) ! used 2 times
> | 1
> Error: Function ‘tmp_jamp’ at (1) has no IMPLICIT type
> born_matrix.f:1222:51:
>
> 1222 | TMP_JAMP(126) = TMP_JAMP(80) + (1) * TMP_JAMP(73) ! used 2 times
> | 1
> Error: Function ‘tmp_jamp’ at (1) has no IMPLICIT type
> born_matrix.f:1223:6:
>
> 1223 | TMP_JAMP(125) = TMP_JAMP(82) + (1) * TMP_JAMP(81) ! used 2 times
> | 1
> Error: Function ‘tmp_jamp’ at (1) has no IMPLICIT type
> born_matrix.f:1223:51:
>
> 1223 | TMP_JAMP(125) = TMP_JAMP(82) + (1) * TMP_JAMP(81) ! used 2 times
> | 1
> Error: Function ‘tmp_jamp’ at (1) has no IMPLICIT type
> born_matrix.f:1224:6:
>
> 1224 | TMP_JAMP(124) = TMP_JAMP(84) + (1) * TMP_JAMP(83) ! used 2 times
> | 1
> Error: Function ‘tmp_jamp’ at (1) has no IMPLICIT type
> born_matrix.f:1224:51:
>
> 1224 | TMP_JAMP(124) = TMP_JAMP(84) + (1) * TMP_JAMP(83) ! used 2 times
> | 1
> Error: Function ‘tmp_jamp’ at (1) has no IMPLICIT type
> born_matrix.f:1225:6:
>
> 1225 | TMP_JAMP(123) = TMP_JAMP(87) + (1) * TMP_JAMP(86) ! used 2 times
> | 1
> Error: Function ‘tmp_jamp’ at (1) has no IMPLICIT type
> born_matrix.f:1225:51:
>
> 1225 | TMP_JAMP(123) = TMP_JAMP(87) + (1) * TMP_JAMP(86) ! used 2 times
> | 1
> Error: Function ‘tmp_jamp’ at (1) has no IMPLICIT type
> born_matrix.f:1226:6:
>
> 1226 | TMP_JAMP(122) = TMP_JAMP(89) + (1) * TMP_JAMP(88) ! used 2 times
> | 1
> Error: Function ‘tmp_jamp’ at (1) has no IMPLICIT type
> born_matrix.f:1226:51:
>
> 1226 | TMP_JAMP(122) = TMP_JAMP(89) + (1) * TMP_JAMP(88) ! used 2 times
> | 1
> Error: Function ‘tmp_jamp’ at (1) has no IMPLICIT type
> born_matrix.f:1227:6:
>
> 1227 | TMP_JAMP(121) = TMP_JAMP(91) + (1) * TMP_JAMP(90) ! used 2 times
> | 1
> Error: Function ‘tmp_jamp’ at (1) has no IMPLICIT type
> born_matrix.f:1227:51:
>
> 1227 | TMP_JAMP(121) = TMP_JAMP(91) + (1) * TMP_JAMP(90) ! used 2 times
> | 1
> Error: Function ‘tmp_jamp’ at (1) has no IMPLICIT type
> born_matrix.f:1228:6:
>
> 1228 | TMP_JAMP(120) = TMP_JAMP(92) + (1) * TMP_JAMP(85) ! used 2 times
> | 1
> Error: Function ‘tmp_jamp’ at (1) has no IMPLICIT type
> born_matrix.f:1228:51:
>
> 1228 | TMP_JAMP(120) = TMP_JAMP(92) + (1) * TMP_JAMP(85) ! used 2 times
> | 1
> Error: Function ‘tmp_jamp’ at (1) has no IMPLICIT type
> born_matrix.f:1229:6:
>
> 1229 | TMP_JAMP(119) = TMP_JAMP(94) + (1) * TMP_JAMP(93) ! used 2 times
> | 1
> Error: Function ‘tmp_jamp’ at (1) has no IMPLICIT type
> born_matrix.f:1229:51:
>
> 1229 | TMP_JAMP(119) = TMP_JAMP(94) + (1) * TMP_JAMP(93) ! used 2 times
> | 1
> Error: Function ‘tmp_jamp’ at (1) has no IMPLICIT type
> born_matrix.f:1230:6:
>
> 1230 | TMP_JAMP(118) = TMP_JAMP(96) + (1) * TMP_JAMP(95) ! used 2 times
> | 1
> Error: Function ‘tmp_jamp’ at (1) has no IMPLICIT type
> born_matrix.f:1230:51:
>
> 1230 | TMP_JAMP(118) = TMP_JAMP(96) + (1) * TMP_JAMP(95) ! used 2 times
> | 1
> Error: Function ‘tmp_jamp’ at (1) has no IMPLICIT type
> born_matrix.f:1231:6:
>
> 1231 | TMP_JAMP(117) = TMP_JAMP(98) + (1) * TMP_JAMP(97) ! used 2 times
> | 1
> Error: Function ‘tmp_jamp’ at (1) has no IMPLICIT type
> born_matrix.f:1231:51:
>
> 1231 | TMP_JAMP(117) = TMP_JAMP(98) + (1) * TMP_JAMP(97) ! used 2 times
> | 1
> Error: Function ‘tmp_jamp’ at (1) has no IMPLICIT type
> born_matrix.f:1232:6:
>
> 1232 | TMP_JAMP(116) = TMP_JAMP(100) + (1) * TMP_JAMP(99) ! used 2 times
> | 1
> Error: Function ‘tmp_jamp’ at (1) has no IMPLICIT type
> born_matrix.f:1232:52:
>
> 1232 | TMP_JAMP(116) = TMP_JAMP(100) + (1) * TMP_JAMP(99) ! used 2 times
> | 1
> Error: Function ‘tmp_jamp’ at (1) has no IMPLICIT type
> born_matrix.f:1233:6:
>
> 1233 | TMP_JAMP(115) = TMP_JAMP(102) + (1) * TMP_JAMP(101) ! used 2 times
> | 1
> Error: Function ‘tmp_jamp’ at (1) has no IMPLICIT type
> born_matrix.f:1233:52:
>
> 1233 | TMP_JAMP(115) = TMP_JAMP(102) + (1) * TMP_JAMP(101) ! used 2 times
> | 1
> Error: Function ‘tmp_jamp’ at (1) has no IMPLICIT type
> born_matrix.f:1234:6:
>
> 1234 | TMP_JAMP(114) = TMP_JAMP(104) + (1) * TMP_JAMP(103) ! used 2 times
> | 1
> Error: Function ‘tmp_jamp’ at (1) has no IMPLICIT type
> born_matrix.f:1234:52:
>
> 1234 | TMP_JAMP(114) = TMP_JAMP(104) + (1) * TMP_JAMP(103) ! used 2 times
> | 1
> Error: Function ‘tmp_jamp’ at (1) has no IMPLICIT type
> born_matrix.f:1235:6:
>
> 1235 | TMP_JAMP(113) = TMP_JAMP(106) + (1) * TMP_JAMP(105) ! used 2 times
> | 1
> Error: Function ‘tmp_jamp’ at (1) has no IMPLICIT type
> born_matrix.f:1235:52:
>
> 1235 | TMP_JAMP(113) = TMP_JAMP(106) + (1) * TMP_JAMP(105) ! used 2 times
> | 1
> Error: Function ‘tmp_jamp’ at (1) has no IMPLICIT type
> born_matrix.f:1236:6:
>
> 1236 | TMP_JAMP(112) = TMP_JAMP(108) + (1) * TMP_JAMP(107) ! used 2 times
> | 1
> Error: Function ‘tmp_jamp’ at (1) has no IMPLICIT type
> born_matrix.f:1236:52:
>
> 1236 | TMP_JAMP(112) = TMP_JAMP(108) + (1) * TMP_JAMP(107) ! used 2 times
> | 1
> Error: Function ‘tmp_jamp’ at (1) has no IMPLICIT type
> born_matrix.f:1237:6:
>
> 1237 | TMP_JAMP(111) = TMP_JAMP(110) + (1) * TMP_JAMP(109) ! used 2 times
> | 1
> Error: Function ‘tmp_jamp’ at (1) has no IMPLICIT type
> born_matrix.f:1237:52:
>
> 1237 | TMP_JAMP(111) = TMP_JAMP(110) + (1) * TMP_JAMP(109) ! used 2 times
> | 1
> Error: Function ‘tmp_jamp’ at (1) has no IMPLICIT type
> born_matrix.f:1238:6:
>
> 1238 | TMP_JAMP(192) = TMP_JAMP(111) + (1) * TMP_JAMP(1) ! used 2 times
> | 1
> Error: Function ‘tmp_jamp’ at (1) has no IMPLICIT type
> born_matrix.f:1238:52:
>
> 1238 | TMP_JAMP(192) = TMP_JAMP(111) + (1) * TMP_JAMP(1) ! used 2 times
> | 1
> Error: Function ‘tmp_jamp’ at (1) has no IMPLICIT type
> born_matrix.f:1239:6:
>
> 1239 | TMP_JAMP(191) = TMP_JAMP(113) + (1) * TMP_JAMP(2) ! used 2 times
> | 1
> Error: Function ‘tmp_jamp’ at (1) has no IMPLICIT type
> born_matrix.f:1239:52:
>
> 1239 | TMP_JAMP(191) = TMP_JAMP(113) + (1) * TMP_JAMP(2) ! used 2 times
> | 1
> Error: Function ‘tmp_jamp’ at (1) has no IMPLICIT type
> born_matrix.f:1240:6:
>
> 1240 | TMP_JAMP(190) = TMP_JAMP(115) + (1) * TMP_JAMP(114) ! used 2 times
> | 1
> Error: Function ‘tmp_jamp’ at (1) has no IMPLICIT type
> born_matrix.f:1240:52:
>
> 1240 | TMP_JAMP(190) = TMP_JAMP(115) + (1) * TMP_JAMP(114) ! used 2 times
> | 1
> Error: Function ‘tmp_jamp’ at (1) has no IMPLICIT type
> born_matrix.f:1241:6:
>
> 1241 | TMP_JAMP(189) = TMP_JAMP(117) + (1) * TMP_JAMP(112) ! used 2 times
> | 1
> Error: Function ‘tmp_jamp’ at (1) has no IMPLICIT type
> born_matrix.f:1241:52:
>
> 1241 | TMP_JAMP(189) = TMP_JAMP(117) + (1) * TMP_JAMP(112) ! used 2 times
> | 1
> Error: Function ‘tmp_jamp’ at (1) has no IMPLICIT type
> born_matrix.f:1242:6:
>
> 1242 | TMP_JAMP(188) = TMP_JAMP(119) + (-1) * TMP_JAMP(118) ! used 2 times
> | 1
> Error: Function ‘tmp_jamp’ at (1) has no IMPLICIT type
> born_matrix.f:1242:53:
>
> 1242 | TMP_JAMP(188) = TMP_JAMP(119) + (-1) * TMP_JAMP(118) ! used 2 times
> | 1
> Error: Function ‘tmp_jamp’ at (1) has no IMPLICIT type
> born_matrix.f:1243:6:
>
> 1243 | TMP_JAMP(187) = TMP_JAMP(121) + (-1) * TMP_JAMP(116) ! used 2 times
> | 1
> Error: Function ‘tmp_jamp’ at (1) has no IMPLICIT type
> born_matrix.f:1243:53:
>
> 1243 | TMP_JAMP(187) = TMP_JAMP(121) + (-1) * TMP_JAMP(116) ! used 2 times
> | 1
> Error: Function ‘tmp_jamp’ at (1) has no IMPLICIT type
> born_matrix.f:1244:6:
>
> 1244 | TMP_JAMP(186) = TMP_JAMP(123) + (1) * TMP_JAMP(122) ! used 2 times
> | 1
> Error: Function ‘tmp_jamp’ at (1) has no IMPLICIT type
> born_matrix.f:1244:52:
>
> 1244 | TMP_JAMP(186) = TMP_JAMP(123) + (1) * TMP_JAMP(122) ! used 2 times
> | 1
> Error: Function ‘tmp_jamp’ at (1) has no IMPLICIT type
> born_matrix.f:1245:6:
>
> 1245 | TMP_JAMP(185) = TMP_JAMP(124) + (1) * TMP_JAMP(120) ! used 2 times
> | 1
> Error: Function ‘tmp_jamp’ at (1) has no IMPLICIT type
> born_matrix.f:1245:52:
>
> 1245 | TMP_JAMP(185) = TMP_JAMP(124) + (1) * TMP_JAMP(120) ! used 2 times
> | 1
> Error: Function ‘tmp_jamp’ at (1) has no IMPLICIT type
> born_matrix.f:1246:6:
>
> 1246 | TMP_JAMP(184) = TMP_JAMP(126) + (1) * TMP_JAMP(125) ! used 2 times
> | 1
> Error: Function ‘tmp_jamp’ at (1) has no IMPLICIT type
> born_matrix.f:1246:52:
>
> 1246 | TMP_JAMP(184) = TMP_JAMP(126) + (1) * TMP_JAMP(125) ! used 2 times
> | 1
> Error: Function ‘tmp_jamp’ at (1) has no IMPLICIT type
> born_matrix.f:1247:6:
>
> 1247 | TMP_JAMP(183) = TMP_JAMP(128) + (1) * TMP_JAMP(127) ! used 2 times
> | 1
> Error: Function ‘tmp_jamp’ at (1) has no IMPLICIT type
> born_matrix.f:1247:52:
>
> 1247 | TMP_JAMP(183) = TMP_JAMP(128) + (1) * TMP_JAMP(127) ! used 2 times
> | 1
> Error: Function ‘tmp_jamp’ at (1) has no IMPLICIT type
> born_matrix.f:1248:6:
>
> 1248 | TMP_JAMP(182) = TMP_JAMP(131) + (1) * TMP_JAMP(130) ! used 2 times
> | 1
> Error: Function ‘tmp_jamp’ at (1) has no IMPLICIT type
> born_matrix.f:1248:52:
>
> 1248 | TMP_JAMP(182) = TMP_JAMP(131) + (1) * TMP_JAMP(130) ! used 2 times
> | 1
> Error: Function ‘tmp_jamp’ at (1) has no IMPLICIT type
> born_matrix.f:1249:6:
>
> 1249 | TMP_JAMP(181) = TMP_JAMP(133) + (1) * TMP_JAMP(129) ! used 2 times
> | 1
> Error: Function ‘tmp_jamp’ at (1) has no IMPLICIT type
> born_matrix.f:1249:52:
>
> 1249 | TMP_JAMP(181) = TMP_JAMP(133) + (1) * TMP_JAMP(129) ! used 2 times
> | 1
> Error: Function ‘tmp_jamp’ at (1) has no IMPLICIT type
> born_matrix.f:1250:6:
>
> 1250 | TMP_JAMP(180) = TMP_JAMP(135) + (1) * TMP_JAMP(134) ! used 2 times
> | 1
> Error: Function ‘tmp_jamp’ at (1) has no IMPLICIT type
> born_matrix.f:1250:52:
>
> 1250 | TMP_JAMP(180) = TMP_JAMP(135) + (1) * TMP_JAMP(134) ! used 2 times
> | 1
> Error: Function ‘tmp_jamp’ at (1) has no IMPLICIT type
> born_matrix.f:1251:6:
>
> 1251 | TMP_JAMP(179) = TMP_JAMP(137) + (1) * TMP_JAMP(136) ! used 2 times
> | 1
> Error: Function ‘tmp_jamp’ at (1) has no IMPLICIT type
> born_matrix.f:1251:52:
>
> 1251 | TMP_JAMP(179) = TMP_JAMP(137) + (1) * TMP_JAMP(136) ! used 2 times
> | 1
> Error: Function ‘tmp_jamp’ at (1) has no IMPLICIT type
> born_matrix.f:1252:6:
>
> 1252 | TMP_JAMP(178) = TMP_JAMP(138) + (1) * TMP_JAMP(132) ! used 2 times
> | 1
> Error: Function ‘tmp_jamp’ at (1) has no IMPLICIT type
> born_matrix.f:1252:52:
>
> 1252 | TMP_JAMP(178) = TMP_JAMP(138) + (1) * TMP_JAMP(132) ! used 2 times
> | 1
> Error: Function ‘tmp_jamp’ at (1) has no IMPLICIT type
> born_matrix.f:1253:6:
>
> 1253 | TMP_JAMP(177) = TMP_JAMP(140) + (1) * TMP_JAMP(139) ! used 2 times
> | 1
> Error: Function ‘tmp_jamp’ at (1) has no IMPLICIT type
> born_matrix.f:1253:52:
>
> 1253 | TMP_JAMP(177) = TMP_JAMP(140) + (1) * TMP_JAMP(139) ! used 2 times
> | 1
> Error: Function ‘tmp_jamp’ at (1) has no IMPLICIT type
> born_matrix.f:1254:6:
>
> 1254 | TMP_JAMP(176) = TMP_JAMP(143) + (1) * TMP_JAMP(142) ! used 2 times
> | 1
> Error: Function ‘tmp_jamp’ at (1) has no IMPLICIT type
> born_matrix.f:1254:52:
>
> 1254 | TMP_JAMP(176) = TMP_JAMP(143) + (1) * TMP_JAMP(142) ! used 2 times
> | 1
> Error: Function ‘tmp_jamp’ at (1) has no IMPLICIT type
> born_matrix.f:1255:6:
>
> 1255 | TMP_JAMP(175) = TMP_JAMP(144) + (1) * TMP_JAMP(141) ! used 2 times
> | 1
> Error: Function ‘tmp_jamp’ at (1) has no IMPLICIT type
> born_matrix.f:1255:52:
>
> 1255 | TMP_JAMP(175) = TMP_JAMP(144) + (1) * TMP_JAMP(141) ! used 2 times
> | 1
> Error: Function ‘tmp_jamp’ at (1) has no IMPLICIT type
> born_matrix.f:1256:6:
>
> 1256 | TMP_JAMP(174) = TMP_JAMP(146) + (1) * TMP_JAMP(145) ! used 2 times
> | 1
> Error: Function ‘tmp_jamp’ at (1) has no IMPLICIT type
> born_matrix.f:1256:52:
>
> 1256 | TMP_JAMP(174) = TMP_JAMP(146) + (1) * TMP_JAMP(145) ! used 2 times
> | 1
> Error: Function ‘tmp_jamp’ at (1) has no IMPLICIT type
> born_matrix.f:1257:6:
>
> 1257 | TMP_JAMP(173) = TMP_JAMP(149) + (1) * TMP_JAMP(148) ! used 2 times
> | 1
> Error: Function ‘tmp_jamp’ at (1) has no IMPLICIT type
> born_matrix.f:1257:52:
>
> 1257 | TMP_JAMP(173) = TMP_JAMP(149) + (1) * TMP_JAMP(148) ! used 2 times
> | 1
> Error: Function ‘tmp_jamp’ at (1) has no IMPLICIT type
> born_matrix.f:1258:6:
>
> 1258 | TMP_JAMP(172) = TMP_JAMP(151) + (1) * TMP_JAMP(150) ! used 2 times
> | 1
> Error: Function ‘tmp_jamp’ at (1) has no IMPLICIT type
> born_matrix.f:1258:52:
>
> 1258 | TMP_JAMP(172) = TMP_JAMP(151) + (1) * TMP_JAMP(150) ! used 2 times
> | 1
> Error: Function ‘tmp_jamp’ at (1) has no IMPLICIT type
> born_matrix.f:1259:6:
>
> 1259 | TMP_JAMP(171) = TMP_JAMP(153) + (1) * TMP_JAMP(152) ! used 2 times
> | 1
> Error: Function ‘tmp_jamp’ at (1) has no IMPLICIT type
> born_matrix.f:1259:52:
>
> 1259 | TMP_JAMP(171) = TMP_JAMP(153) + (1) * TMP_JAMP(152) ! used 2 times
> | 1
> Error: Function ‘tmp_jamp’ at (1) has no IMPLICIT type
> born_matrix.f:1260:6:
>
> 1260 | TMP_JAMP(170) = TMP_JAMP(155) + (1) * TMP_JAMP(147) ! used 2 times
> | 1
> Error: Function ‘tmp_jamp’ at (1) has no IMPLICIT type
> born_matrix.f:1260:52:
>
> 1260 | TMP_JAMP(170) = TMP_JAMP(155) + (1) * TMP_JAMP(147) ! used 2 times
> | 1
> Error: Function ‘tmp_jamp’ at (1) has no IMPLICIT type
> born_matrix.f:1261:6:
>
> 1261 | TMP_JAMP(169) = TMP_JAMP(157) + (1) * TMP_JAMP(156) ! used 2 times
> | 1
> Error: Function ‘tmp_jamp’ at (1) has no IMPLICIT type
> born_matrix.f:1261:52:
>
> 1261 | TMP_JAMP(169) = TMP_JAMP(157) + (1) * TMP_JAMP(156) ! used 2 times
> | 1
> Error: Function ‘tmp_jamp’ at (1) has no IMPLICIT type
> born_matrix.f:1262:6:
>
> 1262 | TMP_JAMP(168) = TMP_JAMP(159) + (1) * TMP_JAMP(158) ! used 2 times
> | 1
> Error: Function ‘tmp_jamp’ at (1) has no IMPLICIT type
> born_matrix.f:1262:52:
>
> 1262 | TMP_JAMP(168) = TMP_JAMP(159) + (1) * TMP_JAMP(158) ! used 2 times
> | 1
> Error: Function ‘tmp_jamp’ at (1) has no IMPLICIT type
> born_matrix.f:1263:6:
>
> 1263 | TMP_JAMP(167) = TMP_JAMP(160) + (1) * TMP_JAMP(154) ! used 2 times
> | 1
> Error: Function ‘tmp_jamp’ at (1) has no IMPLICIT type
> born_matrix.f:1263:52:
>
> 1263 | TMP_JAMP(167) = TMP_JAMP(160) + (1) * TMP_JAMP(154) ! used 2 times
> | 1
> Error: Function ‘tmp_jamp’ at (1) has no IMPLICIT type
> born_matrix.f:1264:6:
>
> 1264 | TMP_JAMP(166) = TMP_JAMP(163) + (1) * TMP_JAMP(162) ! used 2 times
> | 1
> Error: Function ‘tmp_jamp’ at (1) has no IMPLICIT type
> born_matrix.f:1264:52:
>
> 1264 | TMP_JAMP(166) = TMP_JAMP(163) + (1) * TMP_JAMP(162) ! used 2 times
> | 1
> Error: Function ‘tmp_jamp’ at (1) has no IMPLICIT type
> born_matrix.f:1265:6:
>
> 1265 | TMP_JAMP(165) = TMP_JAMP(164) + (1) * TMP_JAMP(161) ! used 2 times
> | 1
> Error: Function ‘tmp_jamp’ at (1) has no IMPLICIT type
> born_matrix.f:1265:52:
>
> 1265 | TMP_JAMP(165) = TMP_JAMP(164) + (1) * TMP_JAMP(161) ! used 2 times
> | 1
> Error: Function ‘tmp_jamp’ at (1) has no IMPLICIT type
> born_matrix.f:1266:6:
>
> 1266 | TMP_JAMP(206) = TMP_JAMP(167) + (1) * TMP_JAMP(165) ! used 2 times
> | 1
> Error: Function ‘tmp_jamp’ at (1) has no IMPLICIT type
> born_matrix.f:1266:52:
>
> 1266 | TMP_JAMP(206) = TMP_JAMP(167) + (1) * TMP_JAMP(165) ! used 2 times
> | 1
> Error: Function ‘tmp_jamp’ at (1) has no IMPLICIT type
> born_matrix.f:1267:6:
>
> 1267 | TMP_JAMP(205) = TMP_JAMP(168) + (1) * TMP_JAMP(166) ! used 2 times
> | 1
> Error: Function ‘tmp_jamp’ at (1) has no IMPLICIT type
> born_matrix.f:1267:52:
>
> 1267 | TMP_JAMP(205) = TMP_JAMP(168) + (1) * TMP_JAMP(166) ! used 2 times
> | 1
> Error: Function ‘tmp_jamp’ at (1) has no IMPLICIT type
> born_matrix.f:1268:6:
>
> 1268 | TMP_JAMP(204) = TMP_JAMP(170) + (1) * TMP_JAMP(169) ! used 2 times
> | 1
> Error: Function ‘tmp_jamp’ at (1) has no IMPLICIT type
> born_matrix.f:1268:52:
>
> 1268 | TMP_JAMP(204) = TMP_JAMP(170) + (1) * TMP_JAMP(169) ! used 2 times
> | 1
> Error: Function ‘tmp_jamp’ at (1) has no IMPLICIT type
> born_matrix.f:1269:6:
>
> 1269 | TMP_JAMP(203) = TMP_JAMP(172) + (1) * TMP_JAMP(171) ! used 2 times
> | 1
> Error: Function ‘tmp_jamp’ at (1) has no IMPLICIT type
> born_matrix.f:1269:52:
>
> 1269 | TMP_JAMP(203) = TMP_JAMP(172) + (1) * TMP_JAMP(171) ! used 2 times
> | 1
> Error: Function ‘tmp_jamp’ at (1) has no IMPLICIT type
> born_matrix.f:1270:6:
>
> 1270 | TMP_JAMP(202) = TMP_JAMP(175) + (1) * TMP_JAMP(174) ! used 2 times
> | 1
> Error: Function ‘tmp_jamp’ at (1) has no IMPLICIT type
> born_matrix.f:1270:52:
>
> 1270 | TMP_JAMP(202) = TMP_JAMP(175) + (1) * TMP_JAMP(174) ! used 2 times
> | 1
> Error: Function ‘tmp_jamp’ at (1) has no IMPLICIT type
> born_matrix.f:1271:6:
>
> 1271 | TMP_JAMP(201) = TMP_JAMP(176) + (1) * TMP_JAMP(173) ! used 2 times
> | 1
> Error: Function ‘tmp_jamp’ at (1) has no IMPLICIT type
> born_matrix.f:1271:52:
>
> 1271 | TMP_JAMP(201) = TMP_JAMP(176) + (1) * TMP_JAMP(173) ! used 2 times
> | 1
> Error: Function ‘tmp_jamp’ at (1) has no IMPLICIT type
> born_matrix.f:1272:6:
>
> 1272 | TMP_JAMP(200) = TMP_JAMP(178) + (1) * TMP_JAMP(177) ! used 2 times
> | 1
> Error: Function ‘tmp_jamp’ at (1) has no IMPLICIT type
> born_matrix.f:1272:52:
>
> 1272 | TMP_JAMP(200) = TMP_JAMP(178) + (1) * TMP_JAMP(177) ! used 2 times
> | 1
> Error: Function ‘tmp_jamp’ at (1) has no IMPLICIT type
> born_matrix.f:1273:6:
>
> 1273 | TMP_JAMP(199) = TMP_JAMP(180) + (1) * TMP_JAMP(179) ! used 2 times
> | 1
> Error: Function ‘tmp_jamp’ at (1) has no IMPLICIT type
> born_matrix.f:1273:52:
>
> 1273 | TMP_JAMP(199) = TMP_JAMP(180) + (1) * TMP_JAMP(179) ! used 2 times
> | 1
> Error: Function ‘tmp_jamp’ at (1) has no IMPLICIT type
> born_matrix.f:1274:6:
>
> 1274 | TMP_JAMP(198) = TMP_JAMP(183) + (1) * TMP_JAMP(181) ! used 2 times
> | 1
> Error: Function ‘tmp_jamp’ at (1) has no IMPLICIT type
> born_matrix.f:1274:52:
>
> 1274 | TMP_JAMP(198) = TMP_JAMP(183) + (1) * TMP_JAMP(181) ! used 2 times
> | 1
> Error: Function ‘tmp_jamp’ at (1) has no IMPLICIT type
> born_matrix.f:1275:6:
>
> 1275 | TMP_JAMP(197) = TMP_JAMP(184) + (1) * TMP_JAMP(182) ! used 2 times
> | 1
> Error: Function ‘tmp_jamp’ at (1) has no IMPLICIT type
> born_matrix.f:1275:52:
>
> 1275 | TMP_JAMP(197) = TMP_JAMP(184) + (1) * TMP_JAMP(182) ! used 2 times
> | 1
> Error: Function ‘tmp_jamp’ at (1) has no IMPLICIT type
> born_matrix.f:1276:6:
>
> 1276 | TMP_JAMP(196) = TMP_JAMP(187) + (1) * TMP_JAMP(186) ! used 2 times
> | 1
> Error: Function ‘tmp_jamp’ at (1) has no IMPLICIT type
> born_matrix.f:1276:52:
>
> 1276 | TMP_JAMP(196) = TMP_JAMP(187) + (1) * TMP_JAMP(186) ! used 2 times
> | 1
> Error: Function ‘tmp_jamp’ at (1) has no IMPLICIT type
> born_matrix.f:1277:6:
>
> 1277 | TMP_JAMP(195) = TMP_JAMP(188) + (1) * TMP_JAMP(185) ! used 2 times
> | 1
> Error: Function ‘tmp_jamp’ at (1) has no IMPLICIT type
> born_matrix.f:1277:52:
>
> 1277 | TMP_JAMP(195) = TMP_JAMP(188) + (1) * TMP_JAMP(185) ! used 2 times
> | 1
> Error: Function ‘tmp_jamp’ at (1) has no IMPLICIT type
> born_matrix.f:1278:6:
>
> 1278 | TMP_JAMP(194) = TMP_JAMP(191) + (1) * TMP_JAMP(190) ! used 2 times
> | 1
> Error: Function ‘tmp_jamp’ at (1) has no IMPLICIT type
> born_matrix.f:1278:52:
>
> 1278 | TMP_JAMP(194) = TMP_JAMP(191) + (1) * TMP_JAMP(190) ! used 2 times
> | 1
> Error: Function ‘tmp_jamp’ at (1) has no IMPLICIT type
> born_matrix.f:1279:6:
>
> 1279 | TMP_JAMP(193) = TMP_JAMP(192) + (1) * TMP_JAMP(189) ! used 2 times
> | 1
> Error: Function ‘tmp_jamp’ at (1) has no IMPLICIT type
> born_matrix.f:1279:52:
>
> 1279 | TMP_JAMP(193) = TMP_JAMP(192) + (1) * TMP_JAMP(189) ! used 2 times
> | 1
> Error: Function ‘tmp_jamp’ at (1) has no IMPLICIT type
> born_matrix.f:1280:6:
>
> 1280 | TMP_JAMP(212) = TMP_JAMP(197) + (1) * TMP_JAMP(195) ! used 2 times
> | 1
> Error: Function ‘tmp_jamp’ at (1) has no IMPLICIT type
> born_matrix.f:1280:52:
>
> 1280 | TMP_JAMP(212) = TMP_JAMP(197) + (1) * TMP_JAMP(195) ! used 2 times
> | 1
> Error: Function ‘tmp_jamp’ at (1) has no IMPLICIT type
> born_matrix.f:1281:6:
>
> 1281 | TMP_JAMP(211) = TMP_JAMP(198) + (1) * TMP_JAMP(196) ! used 2 times
> | 1
> Error: Function ‘tmp_jamp’ at (1) has no IMPLICIT type
> born_matrix.f:1281:52:
>
> 1281 | TMP_JAMP(211) = TMP_JAMP(198) + (1) * TMP_JAMP(196) ! used 2 times
> | 1
> Error: Function ‘tmp_jamp’ at (1) has no IMPLICIT type
> born_matrix.f:1282:6:
>
> 1282 | TMP_JAMP(210) = TMP_JAMP(201) + (-1) * TMP_JAMP(199) ! used 2 times
> | 1
> Error: Function ‘tmp_jamp’ at (1) has no IMPLICIT type
> born_matrix.f:1282:53:
>
> 1282 | TMP_JAMP(210) = TMP_JAMP(201) + (-1) * TMP_JAMP(199) ! used 2 times
> | 1
> Error: Function ‘tmp_jamp’ at (1) has no IMPLICIT type
> born_matrix.f:1283:6:
>
> 1283 | TMP_JAMP(209) = TMP_JAMP(202) + (-1) * TMP_JAMP(200) ! used 2 times
> | 1
> Error: Function ‘tmp_jamp’ at (1) has no IMPLICIT type
> born_matrix.f:1283:53:
>
> 1283 | TMP_JAMP(209) = TMP_JAMP(202) + (-1) * TMP_JAMP(200) ! used 2 times
> | 1
> Error: Function ‘tmp_jamp’ at (1) has no IMPLICIT type
> born_matrix.f:1284:6:
>
> 1284 | TMP_JAMP(208) = TMP_JAMP(205) + (1) * TMP_JAMP(204) ! used 2 times
> | 1
> Error: Function ‘tmp_jamp’ at (1) has no IMPLICIT type
> born_matrix.f:1284:52:
>
> 1284 | TMP_JAMP(208) = TMP_JAMP(205) + (1) * TMP_JAMP(204) ! used 2 times
> | 1
> Error: Function ‘tmp_jamp’ at (1) has no IMPLICIT type
> born_matrix.f:1285:6:
>
> 1285 | TMP_JAMP(207) = TMP_JAMP(206) + (1) * TMP_JAMP(203) ! used 2 times
> | 1
> Error: Function ‘tmp_jamp’ at (1) has no IMPLICIT type
> born_matrix.f:1285:52:
>
> 1285 | TMP_JAMP(207) = TMP_JAMP(206) + (1) * TMP_JAMP(203) ! used 2 times
> | 1
> Error: Function ‘tmp_jamp’ at (1) has no IMPLICIT type
> born_matrix.f:1286:6:
>
> 1286 | TMP_JAMP(216) = TMP_JAMP(207) + (1) * TMP_JAMP(194) ! used 2 times
> | 1
> Error: Function ‘tmp_jamp’ at (1) has no IMPLICIT type
> born_matrix.f:1286:52:
>
> 1286 | TMP_JAMP(216) = TMP_JAMP(207) + (1) * TMP_JAMP(194) ! used 2 times
> | 1
> Error: Function ‘tmp_jamp’ at (1) has no IMPLICIT type
> born_matrix.f:1287:6:
>
> 1287 | TMP_JAMP(215) = TMP_JAMP(208) + (1) * TMP_JAMP(193) ! used 2 times
> | 1
> Error: Function ‘tmp_jamp’ at (1) has no IMPLICIT type
> born_matrix.f:1287:52:
>
> 1287 | TMP_JAMP(215) = TMP_JAMP(208) + (1) * TMP_JAMP(193) ! used 2 times
> | 1
> Error: Function ‘tmp_jamp’ at (1) has no IMPLICIT type
> born_matrix.f:1288:6:
>
> 1288 | TMP_JAMP(214) = TMP_JAMP(211) + (-1) * TMP_JAMP(210) ! used 2 times
> | 1
> Error: Function ‘tmp_jamp’ at (1) has no IMPLICIT type
> born_matrix.f:1288:53:
>
> 1288 | TMP_JAMP(214) = TMP_JAMP(211) + (-1) * TMP_JAMP(210) ! used 2 times
> | 1
> Error: Function ‘tmp_jamp’ at (1) has no IMPLICIT type
> born_matrix.f:1289:6:
>
> 1289 | TMP_JAMP(213) = TMP_JAMP(212) + (-1) * TMP_JAMP(209) ! used 2 times
> | 1
> Error: Function ‘tmp_jamp’ at (1) has no IMPLICIT type
> born_matrix.f:1289:53:
>
> 1289 | TMP_JAMP(213) = TMP_JAMP(212) + (-1) * TMP_JAMP(209) ! used 2 times
> | 1
> Error: Function ‘tmp_jamp’ at (1) has no IMPLICIT type
> born_matrix.f:1290:6:
>
> 1290 | TMP_JAMP(218) = TMP_JAMP(215) + (-1) * TMP_JAMP(213) ! used 2 times
> | 1
> Error: Function ‘tmp_jamp’ at (1) has no IMPLICIT type
> born_matrix.f:1290:53:
>
> 1290 | TMP_JAMP(218) = TMP_JAMP(215) + (-1) * TMP_JAMP(213) ! used 2 times
> | 1
> Error: Function ‘tmp_jamp’ at (1) has no IMPLICIT type
> born_matrix.f:1291:6:
>
> 1291 | TMP_JAMP(217) = TMP_JAMP(216) + (-1) * TMP_JAMP(214) ! used 2 times
> | 1
> Error: Function ‘tmp_jamp’ at (1) has no IMPLICIT type
> born_matrix.f:1291:53:
>
> 1291 | TMP_JAMP(217) = TMP_JAMP(216) + (-1) * TMP_JAMP(214) ! used 2 times
> | 1
> Error: Function ‘tmp_jamp’ at (1) has no IMPLICIT type
> born_matrix.f:1292:60:
>
> 1292 | JAMP(1,1) = (1D0/2D0)*TMP_JAMP(217)+(1D0/6D0)*TMP_JAMP(218)
> | 1
> Error: Function ‘tmp_jamp’ at (1) has no IMPLICIT type
> born_matrix.f:1293:62:
>
> 1293 | JAMP(2,1) = (-1D0/6D0)*TMP_JAMP(217)+(-1D0/2D0)*TMP_JAMP(218)
> | 1
> Error: Function ‘tmp_jamp’ at (1) has no IMPLICIT type
> make[1]: *** [makefile:37: born_matrix.o] Error 1
> make[1]: Leaving directory '/mnt/e/mg5_amc_v2_9_2/ee4bnunu_qcd/SubProcesses/P0_epem_vevexbbbxbx/V0_epem_vevexbbbxbx'
> gfortran -o check_poles parton_lum_1.o parton_lum_chooser.o matrix_1.o real_me_chooser.o leshouche_inc_chooser.o fks_inc_chooser.o setcuts.o setscales.o born.o sborn_sf.o b_sf_003.o b_sf_005.o b_sf_007.o b_sf_006.o b_sf_004.o b_sf_009.o b_sf_002.o b_sf_010.o b_sf_001.o b_sf_008.o fks_Sij.o fastjetfortran_madfks_core.o fjcore.o fastjet_wrapper.o fks_singular.o veto_xsec.o montecarlocounter.o reweight_xsec.o boostwdir2.o configs_and_props_inc_chooser.o initcluster.o cluster.o reweight.o get_color.o FKSParamReader.o iproc_map.o MC_integer.o reweight_xsec_events_pdf_dummy.o appl_interface_dummy.o genps_fks.o weight_lines.o cuts.o pythia_unlops.o recluster.o check_poles.o BinothLHA.o born_hel.o -L../../lib/ libMadLoop.a -lcts -liregi -L/mnt/e/mg5_amc_v2_9_2/HEPTools/lib/ -lninja -L/mnt/e/mg5_amc_v2_9_2/HEPTools/lib/ -lavh_olo -L../../lib/ -ldhelas -lgeneric -lmodel -lpdf -lcernlib -lstdc++ -lstdc++
> gfortran: error: libMadLoop.a: No such file or directory
> make: *** [makefile:100: check_poles] Error 1
>
> Please try to fix this compilations issue and retry.
> Help might be found at https://answers.launchpad.net/mg5amcnlo.
> If you think that this is a bug, you can report this at https://bugs.launchpad.net/mg5amcnlo
> WARNING: Fail to compile the Subprocesses
> INFO:
> INFO: Checking test output:
> INFO: P0_epem_vevexbbbxbx
> INFO: Result for test_ME:
> INFO: Passed.
> INFO: Result for test_MC:
> INFO: Passed.
> INFO: Result for check_poles:
> Command "launch auto " interrupted with error:
> FileNotFoundError : [Errno 2] No such file or directory: '/mnt/e/mg5_amc_v2_9_2/ee4bnunu_qcd/SubProcesses/P0_epem_vevexbbbxbx/check_poles.log'
> Please report this bug on https://bugs.launchpad.net/mg5amcnlo
> More information is found in '/mnt/e/mg5_amc_v2_9_2/ee4bnunu_qcd/run_01_tag_1_debug.log'.
> Please attach this file to your report.
>
>
> --
> You received this question notification because you are an answer
> contact for MadGraph5_aMC@NLO.

Can you help with this problem?

Provide an answer of your own, or ask Nikhil Bachhawat for more information if necessary.

To post a message you must log in.