Installation Problem

Asked by Rong on 2009-06-24

Hi:

Thanks for your fantastic teamwork. I have downloaded via bzr and made the installation, however, when it is bulding through scons, an error occurs:

collect2: ld terminated with signal 9 [killed]
scons: ***[.build/dbg/openwns-library/library--main--1.0/libwns.so] Error 1
scons: building terminated because of errors

Could you please help me on this ? I have installed all prerequists

Many thanks

Rong

Question information

Language:
English Edit question
Status:
Answered
For:
openWNS SDK Edit question
Assignee:
No assignee Edit question
Last query:
2009-06-24
Last reply:
2010-01-06
Sebastian Max (smx-comnets) said : #1

Hi Rong,

we need more output from scons - I assume that the three lines posted by you are not the only ones when you are building, right? Could you paste the last (approx.) 100 lines?

Thanks,
Sebastian

Rong (poporong) said : #2

Thanks here comes full:

poporong@andLinux:~$ cd openwns-sdk/
poporong@andLinux:~/openwns-sdk$ ./playground.py install --flavour=dbg
/home/poporong/openwns-sdk/wnsbase/playground/Core.py:33: DeprecationWarning: the sets module is deprecated
  import sets
/home/poporong/openwns-sdk/wnsbase/Interface.py:52: DeprecationWarning: object.__new__() takes no parameters
  obj = object.__new__(cls, *args, **kwargs)
/home/poporong/openwns-sdk/wnsbase/playground/Core.py:177: DeprecationWarning: os.popen4 is deprecated. Use the subprocess module.
  stdin, stdout = os.popen4(preCommand)
Executing: scons dbg --warn=no-missing-sconscript -j 1 default
scons: Reading SConscript files ...
/home/poporong/openwns-sdk/wnsbase/Interface.py:52: DeprecationWarning: object.__new__() takes no parameters
  obj = object.__new__(cls, *args, **kwargs)

scons: warning: The Options class is deprecated; use the Variables class instead.
File "/home/poporong/openwns-sdk/SConstruct", line 46, in <module>

scons: warning: The BoolOption() function is deprecated; use the BoolVariable() function instead.
File "/home/poporong/openwns-sdk/SConstruct", line 47, in <module>

scons: warning: The PathOption() function is deprecated; use the PathVariable() function instead.
File "/home/poporong/openwns-sdk/SConstruct", line 48, in <module>

scons: warning: The PackageOption() function is deprecated; use the PackageVariable() function instead.
File "/home/poporong/openwns-sdk/SConstruct", line 51, in <module>
Checking for icecc compiler...(cached) no
scons: done reading SConscript files.
scons: Building targets ...
g++ -o .build/dbg/openwns-library/library--main--1.0/libwns.so -shared .build/dbg/openwns-library/library--main--1.0/src/Assure.os .build/dbg/openwns-library/library--main--1.0/src/Birthmark.os .build/dbg/openwns-library/library--main--1.0/src/Direction.os .build/dbg/openwns-library/library--main--1.0/src/Exception.os .build/dbg/openwns-library/library--main--1.0/src/TestFixture.os .build/dbg/openwns-library/library--main--1.0/src/StopWatch.os .build/dbg/openwns-library/library--main--1.0/src/Chamaeleon.os .build/dbg/openwns-library/library--main--1.0/src/IOutputStreamable.os .build/dbg/openwns-library/library--main--1.0/src/PythonicOutput.os .build/dbg/openwns-library/library--main--1.0/src/Backtrace.os .build/dbg/openwns-library/library--main--1.0/src/demangle.os .build/dbg/openwns-library/library--main--1.0/src/Object.os .build/dbg/openwns-library/library--main--1.0/src/Positionable.os .build/dbg/openwns-library/library--main--1.0/src/module/Base.os .build/dbg/openwns-library/library--main--1.0/src/module/Release.os .build/dbg/openwns-library/library--main--1.0/src/module/DateTime.os .build/dbg/openwns-library/library--main--1.0/src/simulator/IApplication.os .build/dbg/openwns-library/library--main--1.0/src/simulator/Application.os .build/dbg/openwns-library/library--main--1.0/src/simulator/SignalHandler.os .build/dbg/openwns-library/library--main--1.0/src/simulator/SignalHandlerCallback.os .build/dbg/openwns-library/library--main--1.0/src/simulator/AbortHandler.os .build/dbg/openwns-library/library--main--1.0/src/simulator/SegmentationViolationHandler.os .build/dbg/openwns-library/library--main--1.0/src/simulator/InterruptHandler.os .build/dbg/openwns-library/library--main--1.0/src/simulator/CPUTimeExhaustedHandler.os .build/dbg/openwns-library/library--main--1.0/src/simulator/ISimulator.os .build/dbg/openwns-library/library--main--1.0/src/simulator/Simulator.os .build/dbg/openwns-library/library--main--1.0/src/simulator/UnitTests.os .build/dbg/openwns-library/library--main--1.0/src/simulator/ISimulationModel.os .build/dbg/openwns-library/library--main--1.0/src/simulator/StatusReport.os .build/dbg/openwns-library/library--main--1.0/src/simulator/ProbeWriter.os .build/dbg/openwns-library/library--main--1.0/src/simulator/OutputPreparation.os .build/dbg/openwns-library/library--main--1.0/src/pyconfig/Object.os .build/dbg/openwns-library/library--main--1.0/src/pyconfig/View.os .build/dbg/openwns-library/library--main--1.0/src/pyconfig/Parser.os .build/dbg/openwns-library/library--main--1.0/src/pyconfig/Sequence.os .build/dbg/openwns-library/library--main--1.0/src/pyconfig/helper/Functions.os .build/dbg/openwns-library/library--main--1.0/src/events/scheduler/IEvent.os .build/dbg/openwns-library/library--main--1.0/src/events/scheduler/Interface.os .build/dbg/openwns-library/library--main--1.0/src/events/scheduler/CommandQueue.os .build/dbg/openwns-library/library--main--1.0/src/events/scheduler/Map.os .build/dbg/openwns-library/library--main--1.0/src/events/scheduler/INotification.os .build/dbg/openwns-library/library--main--1.0/src/events/scheduler/Monitor.os .build/dbg/openwns-library/library--main--1.0/src/events/scheduler/RealTime.os .build/dbg/openwns-library/library--main--1.0/src/events/CanTimeout.os .build/dbg/openwns-library/library--main--1.0/src/events/PeriodicTimeout.os .build/dbg/openwns-library/library--main--1.0/src/events/PeriodicRealTimeout.os .build/dbg/openwns-library/library--main--1.0/src/events/tests/MultipleTimeoutTest.os .build/dbg/openwns-library/library--main--1.0/src/evaluation/statistics/stateval.os .build/dbg/openwns-library/library--main--1.0/src/evaluation/statistics/moments.os .build/dbg/openwns-library/library--main--1.0/src/evaluation/statistics/pdf.os .build/dbg/openwns-library/library--main--1.0/src/evaluation/statistics/dlre.os .build/dbg/openwns-library/library--main--1.0/src/evaluation/statistics/dlreg.os .build/dbg/openwns-library/library--main--1.0/src/evaluation/statistics/dlref.os .build/dbg/openwns-library/library--main--1.0/src/evaluation/statistics/dlrep.os .build/dbg/openwns-library/library--main--1.0/src/logger/Master.os .build/dbg/openwns-library/library--main--1.0/src/logger/Message.os .build/dbg/openwns-library/library--main--1.0/src/logger/Logger.os .build/dbg/openwns-library/library--main--1.0/src/logger/OutputStrategy.os .build/dbg/openwns-library/library--main--1.0/src/logger/CoutOutput.os .build/dbg/openwns-library/library--main--1.0/src/logger/CerrOutput.os .build/dbg/openwns-library/library--main--1.0/src/logger/FileOutput.os .build/dbg/openwns-library/library--main--1.0/src/logger/ConsoleFormat.os .build/dbg/openwns-library/library--main--1.0/src/logger/XMLFormat.os .build/dbg/openwns-library/library--main--1.0/src/logger/DelimiterFormat.os .build/dbg/openwns-library/library--main--1.0/src/logger/SQLiteFormat.os .build/dbg/openwns-library/library--main--1.0/src/logger/FormatStrategy.os .build/dbg/openwns-library/library--main--1.0/src/probe/bus/Context.os .build/dbg/openwns-library/library--main--1.0/src/probe/bus/ContextFilterProbeBus.os .build/dbg/openwns-library/library--main--1.0/src/probe/bus/ContextProvider.os .build/dbg/openwns-library/library--main--1.0/src/probe/bus/ContextCollector.os .build/dbg/openwns-library/library--main--1.0/src/probe/bus/LoggingProbeBus.os .build/dbg/openwns-library/library--main--1.0/src/probe/bus/TimeSeriesProbeBus.os .build/dbg/openwns-library/library--main--1.0/src/probe/bus/PassThroughProbeBus.os .build/dbg/openwns-library/library--main--1.0/src/probe/bus/ProbeBus.os .build/dbg/openwns-library/library--main--1.0/src/probe/bus/ProbeBusRegistry.os .build/dbg/openwns-library/library--main--1.0/src/probe/bus/PythonProbeBus.os .build/dbg/openwns-library/library--main--1.0/src/probe/bus/SettlingTimeGuardProbeBus.os .build/dbg/openwns-library/library--main--1.0/src/probe/bus/StatEvalProbeBus.os .build/dbg/openwns-library/library--main--1.0/src/probe/bus/TableProbeBus.os .build/dbg/openwns-library/library--main--1.0/src/probe/bus/TextProbeBus.os .build/dbg/openwns-library/library--main--1.0/src/probe/bus/TimeWindowProbeBus.os .build/dbg/openwns-library/library--main--1.0/src/probe/bus/detail/ObserverPimpl.os .build/dbg/openwns-library/library--main--1.0/src/probe/bus/detail/OutputFormatter.os .build/dbg/openwns-library/library--main--1.0/src/probe/bus/detail/SubjectPimpl.os .build/dbg/openwns-library/library--main--1.0/src/probe/bus/detail/Sorter.os .build/dbg/openwns-library/library--main--1.0/src/probe/bus/detail/StatEvalTable.os .build/dbg/openwns-library/library--main--1.0/src/probe/bus/utils.os .build/dbg/openwns-library/library--main--1.0/src/testing/DetailedListener.os .build/dbg/openwns-library/library--main--1.0/src/testing/TestTool.os .build/dbg/openwns-library/library--main--1.0/src/osi/PDU.os .build/dbg/openwns-library/library--main--1.0/src/osi/PCI.os .build/dbg/openwns-library/library--main--1.0/src/node/Node.os .build/dbg/openwns-library/library--main--1.0/src/node/NodeSimulationModel.os .build/dbg/openwns-library/library--main--1.0/src/node/component/Component.os .build/dbg/openwns-library/library--main--1.0/src/node/component/FQSN.os .build/dbg/openwns-library/library--main--1.0/src/service/tl/PortPool.os .build/dbg/openwns-library/library--main--1.0/src/distribution/Fixed.os .build/dbg/openwns-library/library--main--1.0/src/distribution/NegExp.os .build/dbg/openwns-library/library--main--1.0/src/distribution/Norm.os .build/dbg/openwns-library/library--main--1.0/src/distribution/Uniform.os .build/dbg/openwns-library/library--main--1.0/src/distribution/DiscreteUniform.os .build/dbg/openwns-library/library--main--1.0/src/distribution/Pareto.os .build/dbg/openwns-library/library--main--1.0/src/distribution/Binomial.os .build/dbg/openwns-library/library--main--1.0/src/distribution/Geometric.os .build/dbg/openwns-library/library--main--1.0/src/distribution/Erlang.os .build/dbg/openwns-library/library--main--1.0/src/distribution/Poisson.os .build/dbg/openwns-library/library--main--1.0/src/distribution/CDFTable.os .build/dbg/openwns-library/library--main--1.0/src/distribution/TimeDependent.os .build/dbg/openwns-library/library--main--1.0/src/distribution/Operation.os .build/dbg/openwns-library/library--main--1.0/src/distribution/Rice.os .build/dbg/openwns-library/library--main--1.0/src/queuingsystem/Job.os .build/dbg/openwns-library/library--main--1.0/src/queuingsystem/JobContextProvider.os .build/dbg/openwns-library/library--main--1.0/src/queuingsystem/MM1Step1.os .build/dbg/openwns-library/library--main--1.0/src/queuingsystem/MM1Step2.os .build/dbg/openwns-library/library--main--1.0/src/queuingsystem/MM1Step3.os .build/dbg/openwns-library/library--main--1.0/src/queuingsystem/MM1Step5.os .build/dbg/openwns-library/library--main--1.0/src/queuingsystem/MM1Step6.os .build/dbg/openwns-library/library--main--1.0/src/queuingsystem/GGn.os .build/dbg/openwns-library/library--main--1.0/src/queuingsystem/Server.os .build/dbg/openwns-library/library--main--1.0/src/tests/AverageTest.os .build/dbg/openwns-library/library--main--1.0/src/tests/AssureTest.os .build/dbg/openwns-library/library--main--1.0/src/tests/ChamaeleonTest.os .build/dbg/openwns-library/library--main--1.0/src/tests/ExceptionTest.os .build/dbg/openwns-library/library--main--1.0/src/tests/TypeInfoTest.os .build/dbg/openwns-library/library--main--1.0/src/tests/FunctorTest.os .build/dbg/openwns-library/library--main--1.0/src/tests/StaticFactoryTest.os .build/dbg/openwns-library/library--main--1.0/src/tests/SmartPtrTest.os .build/dbg/openwns-library/library--main--1.0/src/tests/SmartPtrWithDebuggingTest.os .build/dbg/openwns-library/library--main--1.0/src/tests/PythonicOutputTest.os .build/dbg/openwns-library/library--main--1.0/src/tests/StopWatchTest.os .build/dbg/openwns-library/library--main--1.0/src/tests/BacktraceTest.os .build/dbg/openwns-library/library--main--1.0/src/tests/ObserverTest.os .build/dbg/openwns-library/library--main--1.0/src/tests/ObjectTest.os .build/dbg/openwns-library/library--main--1.0/src/tests/IntervalTest.os .build/dbg/openwns-library/library--main--1.0/src/tests/EnumeratorTest.os .build/dbg/openwns-library/library--main--1.0/src/tests/BirthmarkTest.os .build/dbg/openwns-library/library--main--1.0/src/tests/BrokerTest.os .build/dbg/openwns-library/library--main--1.0/src/tests/CacheTest.os .build/dbg/openwns-library/library--main--1.0/src/tests/ClassTest.os .build/dbg/openwns-library/library--main--1.0/src/tests/CloneableTest.os .build/dbg/openwns-library/library--main--1.0/src/tests/DerefLessTest.os .build/dbg/openwns-library/library--main--1.0/src/tests/DirectionTest.os .build/dbg/openwns-library/library--main--1.0/src/tests/DoubleDispatcherTest.os .build/dbg/openwns-library/library--main--1.0/src/tests/EnumTest.os .build/dbg/openwns-library/library--main--1.0/src/tests/NearestNeighbourTest.os .build/dbg/openwns-library/library--main--1.0/src/tests/NLinearTest.os .build/dbg/openwns-library/library--main--1.0/src/tests/PositionableTest.os .build/dbg/openwns-library/library--main--1.0/src/tests/PowerRatioTest.os .build/dbg/openwns-library/library--main--1.0/src/tests/CandITest.os .build/dbg/openwns-library/library--main--1.0/src/tests/RoundRobinTest.os .build/dbg/openwns-library/library--main--1.0/src/tests/SlidingWindowTest.os .build/dbg/openwns-library/library--main--1.0/src/tests/StaticFactoryBrokerTest.os .build/dbg/openwns-library/library--main--1.0/src/tests/TimeWeightedAverageTest.os .build/dbg/openwns-library/library--main--1.0/src/tests/WeightedAverageTest.os .build/dbg/openwns-library/library--main--1.0/src/tests/TypeTraitsTest.os .build/dbg/openwns-library/library--main--1.0/src/module/tests/ModuleTest.os .build/dbg/openwns-library/library--main--1.0/src/module/tests/MultiTypeFactoryTest.os .build/dbg/openwns-library/library--main--1.0/src/simulator/tests/MainTest.os .build/dbg/openwns-library/library--main--1.0/src/container/tests/FastListTest.os .build/dbg/openwns-library/library--main--1.0/src/container/tests/UntypedRegistryTest.os .build/dbg/openwns-library/library--main--1.0/src/container/tests/RegistryTest.os .build/dbg/openwns-library/library--main--1.0/src/container/tests/DynamicMatrixTest.os .build/dbg/openwns-library/library--main--1.0/src/container/tests/PoolTest.os .build/dbg/openwns-library/library--main--1.0/src/container/tests/RangeMapTest.os .build/dbg/openwns-library/library--main--1.0/src/container/tests/MatrixTest.os .build/dbg/openwns-library/library--main--1.0/src/pyconfig/tests/ParserTest.os .build/dbg/openwns-library/library--main--1.0/src/pyconfig/tests/ViewTest.os .build/dbg/openwns-library/library--main--1.0/src/pyconfig/tests/SequenceTest.os .build/dbg/openwns-library/library--main--1.0/src/pyconfig/helper/tests/FunctionsTest.os .build/dbg/openwns-library/library--main--1.0/src/logger/tests/MasterTest.os .build/dbg/openwns-library/library--main--1.0/src/logger/tests/MessageTest.os .build/dbg/openwns-library/library--main--1.0/src/logger/tests/LoggerTest.os .build/dbg/openwns-library/library--main--1.0/src/logger/tests/LoggerTestHelper.os .build/dbg/openwns-library/library--main--1.0/src/probe/bus/tests/ContextTest.os .build/dbg/openwns-library/library--main--1.0/src/probe/bus/tests/ContextFilterProbeBusTest.os .build/dbg/openwns-library/library--main--1.0/src/probe/bus/tests/ContextProviderTest.os .build/dbg/openwns-library/library--main--1.0/src/probe/bus/tests/ContextProviderCollectionTest.os .build/dbg/openwns-library/library--main--1.0/src/probe/bus/tests/ContextCollectorTest.os .build/dbg/openwns-library/library--main--1.0/src/probe/bus/tests/PassThroughProbeBusTest.os .build/dbg/openwns-library/library--main--1.0/src/probe/bus/tests/ProbeBusRegistryTest.os .build/dbg/openwns-library/library--main--1.0/src/probe/bus/tests/ProbeBusStub.os .build/dbg/openwns-library/library--main--1.0/src/probe/bus/tests/PythonProbeBusTest.os .build/dbg/openwns-library/library--main--1.0/src/probe/bus/tests/TimeWindowProbeBusTest.os .build/dbg/openwns-library/library--main--1.0/src/probe/bus/tests/TableProbeBusTest.os .build/dbg/openwns-library/library--main--1.0/src/probe/bus/tests/DevelopersGuideTest.os .build/dbg/openwns-library/library--main--1.0/src/probe/bus/tests/DevelopersGuideTestCollector.os .build/dbg/openwns-library/library--main--1.0/src/probe/bus/tests/DevelopersGuideTestSimpleCollector.os .build/dbg/openwns-library/library--main--1.0/src/probe/bus/detail/tests/SorterTest.os .build/dbg/openwns-library/library--main--1.0/src/evaluation/statistics/tests/StatEvalTest.os .build/dbg/openwns-library/library--main--1.0/src/events/tests/MemberFunctionTest.os .build/dbg/openwns-library/library--main--1.0/src/events/tests/DelayedMemberFunctionTest.os .build/dbg/openwns-library/library--main--1.0/src/events/scheduler/tests/CallableTest.os .build/dbg/openwns-library/library--main--1.0/src/events/scheduler/tests/InterfaceTest.os .build/dbg/openwns-library/library--main--1.0/src/events/scheduler/tests/MapInterfaceTest.os .build/dbg/openwns-library/library--main--1.0/src/events/scheduler/tests/PerformanceTest.os .build/dbg/openwns-library/library--main--1.0/src/events/scheduler/tests/MapPerformanceTest.os .build/dbg/openwns-library/library--main--1.0/src/events/scheduler/tests/BestPracticesTest.os .build/dbg/openwns-library/library--main--1.0/src/events/scheduler/tests/RealTimeTest.os .build/dbg/openwns-library/library--main--1.0/src/events/tests/CanTimeoutTest.os .build/dbg/openwns-library/library--main--1.0/src/events/tests/PeriodicTimeoutTest.os .build/dbg/openwns-library/library--main--1.0/src/events/tests/PeriodicRealTimeoutTest.os .build/dbg/openwns-library/library--main--1.0/src/osi/tests/PCITest.os .build/dbg/openwns-library/library--main--1.0/src/osi/tests/PDUTest.os .build/dbg/openwns-library/library--main--1.0/src/service/nl/tests/Address.os .build/dbg/openwns-library/library--main--1.0/src/node/tests/NodeTest.os .build/dbg/openwns-library/library--main--1.0/src/node/tests/NodeHeaderReaderTest.os .build/dbg/openwns-library/library--main--1.0/src/node/tests/Stub.os .build/dbg/openwns-library/library--main--1.0/src/node/component/tests/ComponentStub.os .build/dbg/openwns-library/library--main--1.0/src/node/component/tests/ComponentTest.os .build/dbg/openwns-library/library--main--1.0/src/node/component/tests/IP.os .build/dbg/openwns-library/library--main--1.0/src/node/component/tests/TCP.os .build/dbg/openwns-library/library--main--1.0/src/node/component/tests/FQSNTest.os .build/dbg/openwns-library/library--main--1.0/src/service/dll/Address.os .build/dbg/openwns-library/library--main--1.0/src/service/dll/ProtocolNumber.os .build/dbg/openwns-library/library--main--1.0/src/service/tl/tests/PortPoolTest.os .build/dbg/openwns-library/library--main--1.0/src/service/phy/phymode/SNR2MIInterface.os .build/dbg/openwns-library/library--main--1.0/src/service/phy/phymode/MI2PERInterface.os .build/dbg/openwns-library/library--main--1.0/src/service/phy/phymode/PhyModeMapperInterface.os .build/dbg/openwns-library/library--main--1.0/src/scheduler/grouper/NoGrouper.os .build/dbg/openwns-library/library--main--1.0/src/scheduler/grouper/SpatialGrouper.os .build/dbg/openwns-library/library--main--1.0/src/scheduler/grouper/TrivialGrouper.os .build/dbg/openwns-library/library--main--1.0/src/scheduler/grouper/RelayMetaGrouper.os .build/dbg/openwns-library/library--main--1.0/src/scheduler/grouper/AllPossibleGroupsGrouper.os .build/dbg/openwns-library/library--main--1.0/src/scheduler/grouper/OptimalGrouper.os .build/dbg/openwns-library/library--main--1.0/src/scheduler/grouper/GreedyGrouper.os .build/dbg/openwns-library/library--main--1.0/src/scheduler/grouper/TreeBasedGrouper.os .build/dbg/openwns-library/library--main--1.0/src/scheduler/grouper/SINRHeuristic.os .build/dbg/openwns-library/library--main--1.0/src/scheduler/grouper/RelayPreferredSINRHeuristic.os .build/dbg/openwns-library/library--main--1.0/src/scheduler/grouper/DoAGrouper.os .build/dbg/openwns-library/library--main--1.0/src/scheduler/grouper/DoAHeuristicLinearCost.os .build/dbg/openwns-library/library--main--1.0/src/scheduler/grouper/DoAHeuristicPreferredAngle.os .build/dbg/openwns-library/library--main--1.0/src/scheduler/MapInfoEntry.os .build/dbg/openwns-library/library--main--1.0/src/scheduler/SchedulingMap.os .build/dbg/openwns-library/library--main--1.0/src/scheduler/strategy/StrategyInterface.os .build/dbg/openwns-library/library--main--1.0/src/scheduler/strategy/Strategy.os .build/dbg/openwns-library/library--main--1.0/src/scheduler/strategy/SchedulerState.os .build/dbg/openwns-library/library--main--1.0/src/scheduler/strategy/RoundRobinUL.os .build/dbg/openwns-library/library--main--1.0/src/scheduler/strategy/CQIEnabledRoundRobinUL.os .build/dbg/openwns-library/library--main--1.0/src/scheduler/strategy/PCRR.os .build/dbg/openwns-library/library--main--1.0/src/scheduler/strategy/EqualTimeRR.os .build/dbg/openwns-library/library--main--1.0/src/scheduler/strategy/ExhaustiveRR.os .build/dbg/openwns-library/library--main--1.0/src/scheduler/strategy/ExhaustiveRRUL.os .build/dbg/openwns-library/library--main--1.0/src/scheduler/strategy/CQIEnabledExhaustiveRR.os .build/dbg/openwns-library/library--main--1.0/src/scheduler/strategy/ProportionalFairBase.os .build/dbg/openwns-library/library--main--1.0/src/scheduler/strategy/ProportionalFairDL.os .build/dbg/openwns-library/library--main--1.0/src/scheduler/strategy/ProportionalFairUL.os .build/dbg/openwns-library/library--main--1.0/src/scheduler/strategy/RelayPreferredRR.os .build/dbg/openwns-library/library--main--1.0/src/scheduler/strategy/staticpriority/SubStrategy.os .build/dbg/openwns-library/library--main--1.0/src/scheduler/strategy/staticpriority/RoundRobin.os .build/dbg/openwns-library/library--main--1.0/src/scheduler/strategy/staticpriority/ExhaustiveRoundRobin.os .build/dbg/openwns-library/library--main--1.0/src/scheduler/strategy/StaticPriority.os .build/dbg/openwns-library/library--main--1.0/src/scheduler/strategy/dsastrategy/DSAStrategy.os .build/dbg/openwns-library/library--main--1.0/src/scheduler/strategy/dsastrategy/DoNotUseDSA.os .build/dbg/openwns-library/library--main--1.0/src/scheduler/strategy/dsastrategy/LinearFFirst.os .build/dbg/openwns-library/library--main--1.0/src/scheduler/strategy/dsastrategy/BestChannel.os .build/dbg/openwns-library/library--main--1.0/src/scheduler/strategy/dsastrategy/BestCapacity.os .build/dbg/openwns-library/library--main--1.0/src/scheduler/strategy/dsastrategy/InterferenceCoordinatedSimple.os .build/dbg/openwns-library/library--main--1.0/src/scheduler/strategy/apcstrategy/APCStrategy.os .build/dbg/openwns-library/library--main--1.0/src/scheduler/strategy/apcstrategy/DoNotUseAPC.os .build/dbg/openwns-library/library--main--1.0/src/scheduler/strategy/apcstrategy/UseNominalTxPower.os .build/dbg/openwns-library/library--main--1.0/src/scheduler/strategy/apcstrategy/FCFSMaxPhyMode.os .build/dbg/openwns-library/library--main--1.0/src/scheduler/strategy/apcstrategy/FairSINR.os .build/dbg/openwns-library/library--main--1.0/src/scheduler/queue/SimpleQueue.os .build/dbg/openwns-library/library--main--1.0/src/scheduler/queue/SegmentingQueue.os .build/dbg/openwns-library/library--main--1.0/src/scheduler/strategy/tests/StrategyTest.os .build/dbg/openwns-library/library--main--1.0/src/scheduler/tests/PhyModeStub.os .build/dbg/openwns-library/library--main--1.0/src/scheduler/tests/PhyModeMapperStub.os .build/dbg/openwns-library/library--main--1.0/src/scheduler/tests/RegistryProxyStub.os .build/dbg/openwns-library/library--main--1.0/src/scheduler/grouper/tests/GrouperStub.os .build/dbg/openwns-library/library--main--1.0/src/scheduler/strategy/tests/ResultsContainer.os .build/dbg/openwns-library/library--main--1.0/src/scheduler/queue/tests/SimpleQueueTest.os .build/dbg/openwns-library/library--main--1.0/src/scheduler/tests/ClassifierPolicyDropIn.os .build/dbg/openwns-library/library--main--1.0/src/distribution/tests/FixedTest.os .build/dbg/openwns-library/library--main--1.0/src/distribution/tests/VarEstimator.os .build/dbg/openwns-library/library--main--1.0/src/distribution/tests/NegExpTest.os .build/dbg/openwns-library/library--main--1.0/src/distribution/tests/ErlangTest.os .build/dbg/openwns-library/library--main--1.0/src/distribution/tests/NormTest.os .build/dbg/openwns-library/library--main--1.0/src/distribution/tests/UniformTest.os .build/dbg/openwns-library/library--main--1.0/src/distribution/tests/DiscreteUniformTest.os .build/dbg/openwns-library/library--main--1.0/src/distribution/tests/PoissonTest.os .build/dbg/openwns-library/library--main--1.0/src/distribution/tests/GeometricTest.os .build/dbg/openwns-library/library--main--1.0/src/distribution/tests/ParetoTest.os .build/dbg/openwns-library/library--main--1.0/src/distribution/tests/BinomialTest.os .build/dbg/openwns-library/library--main--1.0/src/distribution/tests/CDFTableTest.os .build/dbg/openwns-library/library--main--1.0/src/distribution/tests/RiceTest.os .build/dbg/openwns-library/library--main--1.0/src/distribution/tests/TimeDependentTest.os .build/dbg/openwns-library/library--main--1.0/src/distribution/tests/OperationTest.os .build/dbg/openwns-library/library--main--1.0/src/geometry/Point.os .build/dbg/openwns-library/library--main--1.0/src/geometry/Vector.os .build/dbg/openwns-library/library--main--1.0/src/geometry/Shape2D.os .build/dbg/openwns-library/library--main--1.0/src/geometry/AABoundingBox.os .build/dbg/openwns-library/library--main--1.0/src/geometry/LineSegment.os .build/dbg/openwns-library/library--main--1.0/src/geometry/AxisParallelRectangle.os .build/dbg/openwns-library/library--main--1.0/src/geometry/tests/PointTest.os .build/dbg/openwns-library/library--main--1.0/src/geometry/tests/VectorTest.os .build/dbg/openwns-library/library--main--1.0/src/geometry/tests/LineSegmentTest.os .build/dbg/openwns-library/library--main--1.0/src/geometry/tests/AABoundingBoxTest.os .build/dbg/openwns-library/library--main--1.0/src/geometry/tests/AxisParallelRectangleTest.os .build/dbg/openwns-library/library--main--1.0/src/markovchain/tests/MarkovBaseTest.os .build/dbg/openwns-library/library--main--1.0/src/markovchain/tests/MarkovDiscreteTimeTest.os .build/dbg/openwns-library/library--main--1.0/src/markovchain/tests/MarkovContinuousTimeTest.os .build/dbg/openwns-library/library--main--1.0/src/markovchain/tests/MarkovContinuousTimeTrafficTest.os .build/dbg/openwns-library/library--main--1.0/src/markovchain/tests/MarkovDiscreteTimeTrafficTest.os .build/dbg/openwns-library/library--main--1.0/src/ldk/FunctionalUnit.os .build/dbg/openwns-library/library--main--1.0/src/ldk/CommandTypeSpecifier.os .build/dbg/openwns-library/library--main--1.0/src/ldk/Compound.os .build/dbg/openwns-library/library--main--1.0/src/ldk/CommandPool.os .build/dbg/openwns-library/library--main--1.0/src/ldk/CommandProxy.os .build/dbg/openwns-library/library--main--1.0/src/ldk/RandomAccessLink.os .build/dbg/openwns-library/library--main--1.0/src/ldk/SingleLink.os .build/dbg/openwns-library/library--main--1.0/src/ldk/SingleReceptor.os .build/dbg/openwns-library/library--main--1.0/src/ldk/SingleConnector.os .build/dbg/openwns-library/library--main--1.0/src/ldk/SingleDeliverer.os .build/dbg/openwns-library/library--main--1.0/src/ldk/MultiLink.os .build/dbg/openwns-library/library--main--1.0/src/ldk/FirstServeConnector.os .build/dbg/openwns-library/library--main--1.0/src/ldk/RoundRobinLink.os .build/dbg/openwns-library/library--main--1.0/src/ldk/RoundRobinReceptor.os .build/dbg/openwns-library/library--main--1.0/src/ldk/RoundRobinConnector.os .build/dbg/openwns-library/library--main--1.0/src/ldk/RoundRobinDeliverer.os .build/dbg/openwns-library/library--main--1.0/src/ldk/FlowSeparator.os .build/dbg/openwns-library/library--main--1.0/src/ldk/FlowGate.os .build/dbg/openwns-library/library--main--1.0/src/ldk/Group.os .build/dbg/openwns-library/library--main--1.0/src/ldk/SequentlyCallingLinkHandler.os .build/dbg/openwns-library/library--main--1.0/src/ldk/SimpleLinkHandler.os .build/dbg/openwns-library/library--main--1.0/src/ldk/SuspendSupport.os .build/dbg/openwns-library/library--main--1.0/src/ldk/ManagementServiceInterface.os .build/dbg/openwns-library/library--main--1.0/src/ldk/ControlServiceInterface.os .build/dbg/openwns-library/library--main--1.0/src/ldk/fun/Main.os .build/dbg/openwns-library/library--main--1.0/src/ldk/fun/Sub.os .build/dbg/openwns-library/library--main--1.0/src/ldk/utils.os .build/dbg/openwns-library/library--main--1.0/src/ldk/buffer/Buffer.os .build/dbg/openwns-library/library--main--1.0/src/ldk/buffer/Bounded.os .build/dbg/openwns-library/library--main--1.0/src/ldk/buffer/Dropping.os .build/dbg/openwns-library/library--main--1.0/src/ldk/arq/None.os .build/dbg/openwns-library/library--main--1.0/src/ldk/arq/StopAndWait.os .build/dbg/openwns-library/library--main--1.0/src/ldk/arq/CumulativeACK.os .build/dbg/openwns-library/library--main--1.0/src/ldk/arq/SelectiveRepeat.os .build/dbg/openwns-library/library--main--1.0/src/ldk/arq/GoBackN.os .build/dbg/openwns-library/library--main--1.0/src/ldk/arq/PiggyBacker.os .build/dbg/openwns-library/library--main--1.0/src/ldk/arq/statuscollector/None.os .build/dbg/openwns-library/library--main--1.0/src/ldk/arq/statuscollector/Counter.os .build/dbg/openwns-library/library--main--1.0/src/ldk/arq/statuscollector/TwoSizesWindowed.os .build/dbg/openwns-library/library--main--1.0/src/ldk/harq/HARQ.os .build/dbg/openwns-library/library--main--1.0/src/ldk/harq/softcombining/Container.os .build/dbg/openwns-library/library--main--1.0/src/ldk/harq/softcombining/UniformRandomDecoder.os .build/dbg/openwns-library/library--main--1.0/src/ldk/crc/CRC.os .build/dbg/openwns-library/library--main--1.0/src/ldk/crc/CRCFilter.os .build/dbg/openwns-library/library--main--1.0/src/ldk/sar/Fixed.os .build/dbg/openwns-library/library--main--1.0/src/ldk/sar/Soft.os .build/dbg/openwns-library/library--main--1.0/src/ldk/concatenation/Concatenation.os .build/dbg/openwns-library/library--main--1.0/src/ldk/tools/Synchronizer.os .build/dbg/openwns-library/library--main--1.0/src/ldk/tools/Bridge.os .build/dbg/openwns-library/library--main--1.0/src/ldk/tools/Stub.os .build/dbg/openwns-library/library--main--1.0/src/ldk/tools/PERProviderStub.os .build/dbg/openwns-library/library--main--1.0/src/ldk/tools/Forwarder.os .build/dbg/openwns-library/library--main--1.0/src/ldk/tools/Padding.os .build/dbg/openwns-library/library--main--1.0/src/ldk/tools/Gate.os .build/dbg/openwns-library/library--main--1.0/src/ldk/tools/Stutter.os .build/dbg/openwns-library/library--main--1.0/src/ldk/tools/BottleNeckDetective.os .build/dbg/openwns-library/library--main--1.0/src/ldk/tools/Overhead.os .build/dbg/openwns-library/library--main--1.0/src/ldk/tools/Consumer.os .build/dbg/openwns-library/library--main--1.0/src/ldk/tools/ConstantDelay.os .build/dbg/openwns-library/library--main--1.0/src/ldk/probe/Packet.os .build/dbg/openwns-library/library--main--1.0/src/ldk/probe/Window.os .build/dbg/openwns-library/library--main--1.0/src/ldk/probe/ErrorRate.os .build/dbg/openwns-library/library--main--1.0/src/ldk/probe/bus/Packet.os .build/dbg/openwns-library/library--main--1.0/src/ldk/probe/bus/Window.os .build/dbg/openwns-library/library--main--1.0/src/ldk/command/FlowControl.os .build/dbg/openwns-library/library--main--1.0/src/ldk/multiplexer/Dispatcher.os .build/dbg/openwns-library/library--main--1.0/src/ldk/multiplexer/FrameDispatcher.os .build/dbg/openwns-library/library--main--1.0/src/ldk/multiplexer/OpcodeProvider.os .build/dbg/openwns-library/library--main--1.0/src/ldk/multiplexer/OpcodeDeliverer.os .build/dbg/openwns-library/library--main--1.0/src/ldk/multiplexer/OpcodeSetter.os .build/dbg/openwns-library/library--main--1.0/src/ldk/multiplexer/OpcodeKey.os .build/dbg/openwns-library/library--main--1.0/src/ldk/fcf/FrameBuilder.os .build/dbg/openwns-library/library--main--1.0/src/ldk/fcf/PhaseDescriptor.os .build/dbg/openwns-library/library--main--1.0/src/ldk/fcf/TimingControl.os .build/dbg/openwns-library/library--main--1.0/src/ldk/fcf/NewFrameProviderObserver.os .build/dbg/openwns-library/library--main--1.0/src/ldk/flowseparator/NotFoundStrategy.os .build/dbg/openwns-library/library--main--1.0/src/ldk/flowseparator/CreatorStrategy.os .build/dbg/openwns-library/library--main--1.0/src/ldk/tests/LayerTest.os .build/dbg/openwns-library/library--main--1.0/src/ldk/tests/LayerStub.os .build/dbg/openwns-library/library--main--1.0/src/ldk/tests/FunctionalUnitTest.os .build/dbg/openwns-library/library--main--1.0/src/ldk/tests/RoundRobinLinkTest.os .build/dbg/openwns-library/library--main--1.0/src/ldk/tests/RandomAccessLinkTest.os .build/dbg/openwns-library/library--main--1.0/src/ldk/tests/SingleLinkTest.os.build/dbg/openwns-library/library--main--1.0/src/ldk/tests/SingleReceptorTest.os .build/dbg/openwns-library/library--main--1.0/src/ldk/tests/SingleConnectorTest.os .build/dbg/openwns-library/library--main--1.0/src/ldk/tests/SingleDelivererTest.os .build/dbg/openwns-library/library--main--1.0/src/ldk/tests/MultiLinkTest.os .build/dbg/openwns-library/library--main--1.0/src/ldk/tests/FirstServeConnectorTest.os .build/dbg/openwns-library/library--main--1.0/src/ldk/tests/RoundRobinReceptorTest.os .build/dbg/openwns-library/library--main--1.0/src/ldk/tests/RoundRobinConnectorTest.os .build/dbg/openwns-library/library--main--1.0/src/ldk/tests/RoundRobinDelivererTest.os .build/dbg/openwns-library/library--main--1.0/src/ldk/tests/FlowSeparatorTest.os .build/dbg/openwns-library/library--main--1.0/src/ldk/tests/FlowGateTest.os .build/dbg/openwns-library/library--main--1.0/src/ldk/tests/GroupTest.os .build/dbg/openwns-library/library--main--1.0/src/ldk/tests/GroupFlowSeparatorTest.os .build/dbg/openwns-library/library--main--1.0/src/ldk/tests/SpeedTest.os .build/dbg/openwns-library/library--main--1.0/src/ldk/tests/SizeCalculationTest.os.build/dbg/openwns-library/library--main--1.0/src/ldk/tests/DropperTest.os .build/dbg/openwns-library/library--main--1.0/src/ldk/tests/ClassifierTest.os .build/dbg/openwns-library/library--main--1.0/src/ldk/tests/FUTestBase.os .build/dbg/openwns-library/library--main--1.0/src/ldk/tests/FUTestBaseTest.os .build/dbg/openwns-library/library--main--1.0/src/ldk/tests/DelayedInterfaceTest.os .build/dbg/openwns-library/library--main--1.0/src/ldk/tests/CommandProxyTest.os .build/dbg/openwns-library/library--main--1.0/src/ldk/fun/tests/FUNTest.os .build/dbg/openwns-library/library--main--1.0/src/ldk/fun/tests/MainTest.os .build/dbg/openwns-library/library--main--1.0/src/ldk/fun/tests/MainGenericTest.os .build/dbg/openwns-library/library--main--1.0/src/ldk/fun/tests/SubTest.os .build/dbg/openwns-library/library--main--1.0/src/ldk/fsm/tests/FunctionalUnitTest.os .build/dbg/openwns-library/library--main--1.0/src/ldk/arq/tests/NoneTest.os .build/dbg/openwns-library/library--main--1.0/src/ldk/arq/tests/StopAndWaitTest.os .build/dbg/openwns-library/library--main--1.0/src/ldk/arq/tests/CumulativeACKTest.os .build/dbg/openwns-library/library--main--1.0/src/ldk/arq/tests/SelectiveRepeatTest.os .build/dbg/openwns-library/library--main--1.0/src/ldk/arq/tests/GoBackNTest.os .build/dbg/openwns-library/library--main--1.0/src/ldk/arq/tests/PiggyBackerTest.os .build/dbg/openwns-library/library--main--1.0/src/ldk/harq/softcombining/tests/ContainerTest.os .build/dbg/openwns-library/library--main--1.0/src/ldk/crc/tests/CRCTest.os .build/dbg/openwns-library/library--main--1.0/src/ldk/crc/tests/CRCFilterTest.os .build/dbg/openwns-library/library--main--1.0/src/ldk/buffer/tests/BoundedTest.os .build/dbg/openwns-library/library--main--1.0/src/ldk/buffer/tests/DroppingTest.os .build/dbg/openwns-library/library--main--1.0/src/ldk/sar/tests/FixedTest.os .build/dbg/openwns-library/library--main--1.0/src/ldk/tools/tests/ForwarderTest.os .build/dbg/openwns-library/library--main--1.0/src/ldk/tools/tests/ProducerTest.os .build/dbg/openwns-library/library--main--1.0/src/ldk/tools/tests/ConsumerTest.os .build/dbg/openwns-library/library--main--1.0/src/ldk/tools/tests/BridgeTest.os .build/dbg/openwns-library/library--main--1.0/src/ldk/tools/tests/SynchronizerTest.os .build/dbg/openwns-library/library--main--1.0/src/ldk/tools/tests/PaddingTest.os .build/dbg/openwns-library/library--main--1.0/src/ldk/tools/tests/GateTest.os .build/dbg/openwns-library/library--main--1.0/src/ldk/tools/tests/OverheadTest.os .build/dbg/openwns-library/library--main--1.0/src/ldk/multiplexer/tests/OpcodeDelivererTest.os .build/dbg/openwns-library/library--main--1.0/src/ldk/multiplexer/tests/OpcodeTest.os .build/dbg/openwns-library/library--main--1.0/src/ldk/multiplexer/tests/DispatcherTest.os .build/dbg/openwns-library/library--main--1.0/src/ldk/multiplexer/tests/FrameDispatcherTest.os .build/dbg/openwns-library/library--main--1.0/src/ldk/fcf/tests/NewFrameProviderObserverTest.os .build/dbg/openwns-library/library--main--1.0/src/ldk/probe/tests/PacketTest.os .build/dbg/openwns-library/library--main--1.0/src/ldk/probe/tests/WindowTest.os .build/dbg/openwns-library/library--main--1.0/src/fsm/tests/FSMTest.os -Lsandbox/dbg/lib
collect2: ld terminated with signal 9 [Killed]
scons: *** [.build/dbg/openwns-library/library--main--1.0/libwns.so] Error 1
scons: building terminated because of errors.
poporong@andLinux:~/openwns-sdk$

Sorry for this ... Thank you

Rong

Dear Rong,

this is a strange error. It seems that compilation of the sources was
fine and the buildsystem now
tries to link libwns.so . Somehow the linker then gets killed by
SIGKILL. I do not think this has anything to do
with openWNS but rather with your toolchain and your system
configuration. You should check the
following and provide more information:

1. The linker consumes several 100 megabytes of memory when linking
libwns.so . Can this be a problem on your system.
2. Can it be that someone kills your link process because it consumes
too much resource on the machine you're working on?

3. Which operating system do you use? We use ubuntu hardy
4. Which gcc, g++ and ld versions do you use?

I am sorry that I don't have a direct answer on this one. I haven't seen
this error before and I am quite sure
that the error is not related to openWNS. You should also try to

a. Try to compile openWNS on another machine
b. Try to build another C++ program that uses the gcc-toolchain on the
original machine and see if the linker works with this.
     you could download http://www.zlib.net/zlib-1.2.3.tar.gz, unpack
it, run './configure;make' in the extracted subdirectory. If
     this works we could see that your toolchain works in principal.

Let us know about your progress, Regards,
  Daniel

Rong wrote:
> Question #75185 on openWNS SDK changed:
> https://answers.launchpad.net/openwns-sdk/+question/75185
>
> Status: Needs information => Open
>
> Rong gave more information on the question:
> Thanks here comes full:
>
> poporong@andLinux:~$ cd openwns-sdk/
> poporong@andLinux:~/openwns-sdk$ ./playground.py install --flavour=dbg
> /home/poporong/openwns-sdk/wnsbase/playground/Core.py:33: DeprecationWarning: the sets module is deprecated
> import sets
> /home/poporong/openwns-sdk/wnsbase/Interface.py:52: DeprecationWarning: object.__new__() takes no parameters
> obj = object.__new__(cls, *args, **kwargs)
> /home/poporong/openwns-sdk/wnsbase/playground/Core.py:177: DeprecationWarning: os.popen4 is deprecated. Use the subprocess module.
> stdin, stdout = os.popen4(preCommand)
> Executing: scons dbg --warn=no-missing-sconscript -j 1 default
> scons: Reading SConscript files ...
> /home/poporong/openwns-sdk/wnsbase/Interface.py:52: DeprecationWarning: object.__new__() takes no parameters
> obj = object.__new__(cls, *args, **kwargs)
>
> scons: warning: The Options class is deprecated; use the Variables class instead.
> File "/home/poporong/openwns-sdk/SConstruct", line 46, in <module>
>
> scons: warning: The BoolOption() function is deprecated; use the BoolVariable() function instead.
> File "/home/poporong/openwns-sdk/SConstruct", line 47, in <module>
>
> scons: warning: The PathOption() function is deprecated; use the PathVariable() function instead.
> File "/home/poporong/openwns-sdk/SConstruct", line 48, in <module>
>
> scons: warning: The PackageOption() function is deprecated; use the PackageVariable() function instead.
> File "/home/poporong/openwns-sdk/SConstruct", line 51, in <module>
> Checking for icecc compiler...(cached) no
> scons: done reading SConscript files.
> scons: Building targets ...
> g++ -o .build/dbg/openwns-library/library--main--1.0/libwns.so -shared .build/dbg/openwns-library/library--main--1.0/src/Assure.os .build/dbg/openwns-library/library--main--1.0/src/Birthmark.os .build/dbg/openwns-library/library--main--1.0/src/Direction.os .build/dbg/openwns-library/library--main--1.0/src/Exception.os .build/dbg/openwns-library/library--main--1.0/src/TestFixture.os .build/dbg/openwns-library/library--main--1.0/src/StopWatch.os .build/dbg/openwns-library/library--main--1.0/src/Chamaeleon.os .build/dbg/openwns-library/library--main--1.0/src/IOutputStreamable.os .build/dbg/openwns-library/library--main--1.0/src/PythonicOutput.os .build/dbg/openwns-library/library--main--1.0/src/Backtrace.os .build/dbg/openwns-library/library--main--1.0/src/demangle.os .build/dbg/openwns-library/library--main--1.0/src/Object.os .build/dbg/openwns-library/library--main--1.0/src/Positionable.os .build/dbg/openwns-library/library--main--1.0/src/module/Base.os .build/dbg/openwns-library/library--main--1.0/src/module/Release.os .build/dbg/openwns-library/library--main--1.0/src/module/DateTime.os .build/dbg/openwns-library/library--main--1.0/src/simulator/IApplication.os .build/dbg/openwns-library/library--main--1.0/src/simulator/Application.os .build/dbg/openwns-library/library--main--1.0/src/simulator/SignalHandler.os .build/dbg/openwns-library/library--main--1.0/src/simulator/SignalHandlerCallback.os .build/dbg/openwns-library/library--main--1.0/src/simulator/AbortHandler.os .build/dbg/openwns-library/library--main--1.0/src/simulator/SegmentationViolationHandler.os .build/dbg/openwns-library/library--main--1.0/src/simulator/InterruptHandler.os .build/dbg/openwns-library/library--main--1.0/src/simulator/CPUTimeExhaustedHandler.os .build/dbg/openwns-library/library--main--1.0/src/simulator/ISimulator.os .build/dbg/openwns-library/library--main--1.0/src/simulator/Simulator.os .build/dbg/openwns-library/library--main--1.0/src/simulator/UnitTests.os .build/dbg/openwns-library/library--main--1.0/src/simulator/ISimulationModel.os .build/dbg/openwns-library/library--main--1.0/src/simulator/StatusReport.os .build/dbg/openwns-library/library--main--1.0/src/simulator/ProbeWriter.os .build/dbg/openwns-library/library--main--1.0/src/simulator/OutputPreparation.os .build/dbg/openwns-library/library--main--1.0/src/pyconfig/Object.os .build/dbg/openwns-library/library--main--1.0/src/pyconfig/View.os .build/dbg/openwns-library/library--main--1.0/src/pyconfig/Parser.os .build/dbg/openwns-library/library--main--1.0/src/pyconfig/Sequence.os .build/dbg/openwns-library/library--main--1.0/src/pyconfig/helper/Functions.os .build/dbg/openwns-library/library--main--1.0/src/events/scheduler/IEvent.os .build/dbg/openwns-library/library--main--1.0/src/events/scheduler/Interface.os .build/dbg/openwns-library/library--main--1.0/src/events/scheduler/CommandQueue.os .build/dbg/openwns-library/library--main--1.0/src/events/scheduler/Map.os .build/dbg/openwns-library/library--main--1.0/src/events/scheduler/INotification.os .build/dbg/openwns-library/library--main--1.0/src/events/scheduler/Monitor.os .build/dbg/openwns-library/library--main--1.0/src/events/scheduler/RealTime.os .build/dbg/openwns-library/library--main--1.0/src/events/CanTimeout.os .build/dbg/openwns-library/library--main--1.0/src/events/PeriodicTimeout.os .build/dbg/openwns-library/library--main--1.0/src/events/PeriodicRealTimeout.os .build/dbg/openwns-library/library--main--1.0/src/events/tests/MultipleTimeoutTest.os .build/dbg/openwns-library/library--main--1.0/src/evaluation/statistics/stateval.os .build/dbg/openwns-library/library--main--1.0/src/evaluation/statistics/moments.os .build/dbg/openwns-library/library--main--1.0/src/evaluation/statistics/pdf.os .build/dbg/openwns-library/library--main--1.0/src/evaluation/statistics/dlre.os .build/dbg/openwns-library/library--main--1.0/src/evaluation/statistics/dlreg.os .build/dbg/openwns-library/library--main--1.0/src/evaluation/statistics/dlref.os .build/dbg/openwns-library/library--main--1.0/src/evaluation/statistics/dlrep.os .build/dbg/openwns-library/library--main--1.0/src/logger/Master.os .build/dbg/openwns-library/library--main--1.0/src/logger/Message.os .build/dbg/openwns-library/library--main--1.0/src/logger/Logger.os .build/dbg/openwns-library/library--main--1.0/src/logger/OutputStrategy.os .build/dbg/openwns-library/library--main--1.0/src/logger/CoutOutput.os .build/dbg/openwns-library/library--main--1.0/src/logger/CerrOutput.os .build/dbg/openwns-library/library--main--1.0/src/logger/FileOutput.os .build/dbg/openwns-library/library--main--1.0/src/logger/ConsoleFormat.os .build/dbg/openwns-library/library--main--1.0/src/logger/XMLFormat.os .build/dbg/openwns-library/library--main--1.0/src/logger/DelimiterFormat.os .build/dbg/openwns-library/library--main--1.0/src/logger/SQLiteFormat.os .build/dbg/openwns-library/library--main--1.0/src/logger/FormatStrategy.os .build/dbg/openwns-library/library--main--1.0/src/probe/bus/Context.os .build/dbg/openwns-library/library--main--1.0/src/probe/bus/ContextFilterProbeBus.os .build/dbg/openwns-library/library--main--1.0/src/probe/bus/ContextProvider.os .build/dbg/openwns-library/library--main--1.0/src/probe/bus/ContextCollector.os .build/dbg/openwns-library/library--main--1.0/src/probe/bus/LoggingProbeBus.os .build/dbg/openwns-library/library--main--1.0/src/probe/bus/TimeSeriesProbeBus.os .build/dbg/openwns-library/library--main--1.0/src/probe/bus/PassThroughProbeBus.os .build/dbg/openwns-library/library--main--1.0/src/probe/bus/ProbeBus.os .build/dbg/openwns-library/library--main--1.0/src/probe/bus/ProbeBusRegistry.os .build/dbg/openwns-library/library--main--1.0/src/probe/bus/PythonProbeBus.os .build/dbg/openwns-library/library--main--1.0/src/probe/bus/SettlingTimeGuardProbeBus.os .build/dbg/openwns-library/library--main--1.0/src/probe/bus/StatEvalProbeBus.os .build/dbg/openwns-library/library--main--1.0/src/probe/bus/TableProbeBus.os .build/dbg/openwns-library/library--main--1.0/src/probe/bus/TextProbeBus.os .build/dbg/openwns-library/library--main--1.0/src/probe/bus/TimeWindowProbeBus.os .build/dbg/openwns-library/library--main--1.0/src/probe/bus/detail/ObserverPimpl.os .build/dbg/openwns-library/library--main--1.0/src/probe/bus/detail/OutputFormatter.os .build/dbg/openwns-library/library--main--1.0/src/probe/bus/detail/SubjectPimpl.os .build/dbg/openwns-library/library--main--1.0/src/probe/bus/detail/Sorter.os .build/dbg/openwns-library/library--main--1.0/src/probe/bus/detail/StatEvalTable.os .build/dbg/openwns-library/library--main--1.0/src/probe/bus/utils.os .build/dbg/openwns-library/library--main--1.0/src/testing/DetailedListener.os .build/dbg/openwns-library/library--main--1.0/src/testing/TestTool.os .build/dbg/openwns-library/library--main--1.0/src/osi/PDU.os .build/dbg/openwns-library/library--main--1.0/src/osi/PCI.os .build/dbg/openwns-library/library--main--1.0/src/node/Node.os .build/dbg/openwns-library/library--main--1.0/src/node/NodeSimulationModel.os .build/dbg/openwns-library/library--main--1.0/src/node/component/Component.os .build/dbg/openwns-library/library--main--1.0/src/node/component/FQSN.os .build/dbg/openwns-library/library--main--1.0/src/service/tl/PortPool.os .build/dbg/openwns-library/library--main--1.0/src/distribution/Fixed.os .build/dbg/openwns-library/library--main--1.0/src/distribution/NegExp.os .build/dbg/openwns-library/library--main--1.0/src/distribution/Norm.os .build/dbg/openwns-library/library--main--1.0/src/distribution/Uniform.os .build/dbg/openwns-library/library--main--1.0/src/distribution/DiscreteUniform.os .build/dbg/openwns-library/library--main--1.0/src/distribution/Pareto.os .build/dbg/openwns-library/library--main--1.0/src/distribution/Binomial.os .build/dbg/openwns-library/library--main--1.0/src/distribution/Geometric.os .build/dbg/openwns-library/library--main--1.0/src/distribution/Erlang.os .build/dbg/openwns-library/library--main--1.0/src/distribution/Poisson.os .build/dbg/openwns-library/library--main--1.0/src/distribution/CDFTable.os .build/dbg/openwns-library/library--main--1.0/src/distribution/TimeDependent.os .build/dbg/openwns-library/library--main--1.0/src/distribution/Operation.os .build/dbg/openwns-library/library--main--1.0/src/distribution/Rice.os .build/dbg/openwns-library/library--main--1.0/src/queuingsystem/Job.os .build/dbg/openwns-library/library--main--1.0/src/queuingsystem/JobContextProvider.os .build/dbg/openwns-library/library--main--1.0/src/queuingsystem/MM1Step1.os .build/dbg/openwns-library/library--main--1.0/src/queuingsystem/MM1Step2.os .build/dbg/openwns-library/library--main--1.0/src/queuingsystem/MM1Step3.os .build/dbg/openwns-library/library--main--1.0/src/queuingsystem/MM1Step5.os .build/dbg/openwns-library/library--main--1.0/src/queuingsystem/MM1Step6.os .build/dbg/openwns-library/library--main--1.0/src/queuingsystem/GGn.os .build/dbg/openwns-library/library--main--1.0/src/queuingsystem/Server.os .build/dbg/openwns-library/library--main--1.0/src/tests/AverageTest.os .build/dbg/openwns-library/library--main--1.0/src/tests/AssureTest.os .build/dbg/openwns-library/library--main--1.0/src/tests/ChamaeleonTest.os .build/dbg/openwns-library/library--main--1.0/src/tests/ExceptionTest.os .build/dbg/openwns-library/library--main--1.0/src/tests/TypeInfoTest.os .build/dbg/openwns-library/library--main--1.0/src/tests/FunctorTest.os .build/dbg/openwns-library/library--main--1.0/src/tests/StaticFactoryTest.os .build/dbg/openwns-library/library--main--1.0/src/tests/SmartPtrTest.os .build/dbg/openwns-library/library--main--1.0/src/tests/SmartPtrWithDebuggingTest.os .build/dbg/openwns-library/library--main--1.0/src/tests/PythonicOutputTest.os .build/dbg/openwns-library/library--main--1.0/src/tests/StopWatchTest.os .build/dbg/openwns-library/library--main--1.0/src/tests/BacktraceTest.os .build/dbg/openwns-library/library--main--1.0/src/tests/ObserverTest.os .build/dbg/openwns-library/library--main--1.0/src/tests/ObjectTest.os .build/dbg/openwns-library/library--main--1.0/src/tests/IntervalTest.os .build/dbg/openwns-library/library--main--1.0/src/tests/EnumeratorTest.os .build/dbg/openwns-library/library--main--1.0/src/tests/BirthmarkTest.os .build/dbg/openwns-library/library--main--1.0/src/tests/BrokerTest.os .build/dbg/openwns-library/library--main--1.0/src/tests/CacheTest.os .build/dbg/openwns-library/library--main--1.0/src/tests/ClassTest.os .build/dbg/openwns-library/library--main--1.0/src/tests/CloneableTest.os .build/dbg/openwns-library/library--main--1.0/src/tests/DerefLessTest.os .build/dbg/openwns-library/library--main--1.0/src/tests/DirectionTest.os .build/dbg/openwns-library/library--main--1.0/src/tests/DoubleDispatcherTest.os .build/dbg/openwns-library/library--main--1.0/src/tests/EnumTest.os .build/dbg/openwns-library/library--main--1.0/src/tests/NearestNeighbourTest.os .build/dbg/openwns-library/library--main--1.0/src/tests/NLinearTest.os .build/dbg/openwns-library/library--main--1.0/src/tests/PositionableTest.os .build/dbg/openwns-library/library--main--1.0/src/tests/PowerRatioTest.os .build/dbg/openwns-library/library--main--1.0/src/tests/CandITest.os .build/dbg/openwns-library/library--main--1.0/src/tests/RoundRobinTest.os .build/dbg/openwns-library/library--main--1.0/src/tests/SlidingWindowTest.os .build/dbg/openwns-library/library--main--1.0/src/tests/StaticFactoryBrokerTest.os .build/dbg/openwns-library/library--main--1.0/src/tests/TimeWeightedAverageTest.os .build/dbg/openwns-library/library--main--1.0/src/tests/WeightedAverageTest.os .build/dbg/openwns-library/library--main--1.0/src/tests/TypeTraitsTest.os .build/dbg/openwns-library/library--main--1.0/src/module/tests/ModuleTest.os .build/dbg/openwns-library/library--main--1.0/src/module/tests/MultiTypeFactoryTest.os .build/dbg/openwns-library/library--main--1.0/src/simulator/tests/MainTest.os .build/dbg/openwns-library/library--main--1.0/src/container/tests/FastListTest.os .build/dbg/openwns-library/library--main--1.0/src/container/tests/UntypedRegistryTest.os .build/dbg/openwns-library/library--main--1.0/src/container/tests/RegistryTest.os .build/dbg/openwns-library/library--main--1.0/src/container/tests/DynamicMatrixTest.os .build/dbg/openwns-library/library--main--1.0/src/container/tests/PoolTest.os .build/dbg/openwns-library/library--main--1.0/src/container/tests/RangeMapTest.os .build/dbg/openwns-library/library--main--1.0/src/container/tests/MatrixTest.os .build/dbg/openwns-library/library--main--1.0/src/pyconfig/tests/ParserTest.os .build/dbg/openwns-library/library--main--1.0/src/pyconfig/tests/ViewTest.os .build/dbg/openwns-library/library--main--1.0/src/pyconfig/tests/SequenceTest.os .build/dbg/openwns-library/library--main--1.0/src/pyconfig/helper/tests/FunctionsTest.os .build/dbg/openwns-library/library--main--1.0/src/logger/tests/MasterTest.os .build/dbg/openwns-library/library--main--1.0/src/logger/tests/MessageTest.os .build/dbg/openwns-library/library--main--1.0/src/logger/tests/LoggerTest.os .build/dbg/openwns-library/library--main--1.0/src/logger/tests/LoggerTestHelper.os .build/dbg/openwns-library/library--main--1.0/src/probe/bus/tests/ContextTest.os .build/dbg/openwns-library/library--main--1.0/src/probe/bus/tests/ContextFilterProbeBusTest.os .build/dbg/openwns-library/library--main--1.0/src/probe/bus/tests/ContextProviderTest.os .build/dbg/openwns-library/library--main--1.0/src/probe/bus/tests/ContextProviderCollectionTest.os .build/dbg/openwns-library/library--main--1.0/src/probe/bus/tests/ContextCollectorTest.os .build/dbg/openwns-library/library--main--1.0/src/probe/bus/tests/PassThroughProbeBusTest.os .build/dbg/openwns-library/library--main--1.0/src/probe/bus/tests/ProbeBusRegistryTest.os .build/dbg/openwns-library/library--main--1.0/src/probe/bus/tests/ProbeBusStub.os .build/dbg/openwns-library/library--main--1.0/src/probe/bus/tests/PythonProbeBusTest.os .build/dbg/openwns-library/library--main--1.0/src/probe/bus/tests/TimeWindowProbeBusTest.os .build/dbg/openwns-library/library--main--1.0/src/probe/bus/tests/TableProbeBusTest.os .build/dbg/openwns-library/library--main--1.0/src/probe/bus/tests/DevelopersGuideTest.os .build/dbg/openwns-library/library--main--1.0/src/probe/bus/tests/DevelopersGuideTestCollector.os .build/dbg/openwns-library/library--main--1.0/src/probe/bus/tests/DevelopersGuideTestSimpleCollector.os .build/dbg/openwns-library/library--main--1.0/src/probe/bus/detail/tests/SorterTest.os .build/dbg/openwns-library/library--main--1.0/src/evaluation/statistics/tests/StatEvalTest.os .build/dbg/openwns-library/library--main--1.0/src/events/tests/MemberFunctionTest.os .build/dbg/openwns-library/library--main--1.0/src/events/tests/DelayedMemberFunctionTest.os .build/dbg/openwns-library/library--main--1.0/src/events/scheduler/tests/CallableTest.os .build/dbg/openwns-library/library--main--1.0/src/events/scheduler/tests/InterfaceTest.os .build/dbg/openwns-library/library--main--1.0/src/events/scheduler/tests/MapInterfaceTest.os .build/dbg/openwns-library/library--main--1.0/src/events/scheduler/tests/PerformanceTest.os .build/dbg/openwns-library/library--main--1.0/src/events/scheduler/tests/MapPerformanceTest.os .build/dbg/openwns-library/library--main--1.0/src/events/scheduler/tests/BestPracticesTest.os .build/dbg/openwns-library/library--main--1.0/src/events/scheduler/tests/RealTimeTest.os .build/dbg/openwns-library/library--main--1.0/src/events/tests/CanTimeoutTest.os .build/dbg/openwns-library/library--main--1.0/src/events/tests/PeriodicTimeoutTest.os .build/dbg/openwns-library/library--main--1.0/src/events/tests/PeriodicRealTimeoutTest.os .build/dbg/openwns-library/library--main--1.0/src/osi/tests/PCITest.os .build/dbg/openwns-library/library--main--1.0/src/osi/tests/PDUTest.os .build/dbg/openwns-library/library--main--1.0/src/service/nl/tests/Address.os .build/dbg/openwns-library/library--main--1.0/src/node/tests/NodeTest.os .build/dbg/openwns-library/library--main--1.0/src/node/tests/NodeHeaderReaderTest.os .build/dbg/openwns-library/library--main--1.0/src/node/tests/Stub.os .build/dbg/openwns-library/library--main--1.0/src/node/component/tests/ComponentStub.os .build/dbg/openwns-library/library--main--1.0/src/node/component/tests/ComponentTest.os .build/dbg/openwns-library/library--main--1.0/src/node/component/tests/IP.os .build/dbg/openwns-library/library--main--1.0/src/node/component/tests/TCP.os .build/dbg/openwns-library/library--main--1.0/src/node/component/tests/FQSNTest.os .build/dbg/openwns-library/library--main--1.0/src/service/dll/Address.os .build/dbg/openwns-library/library--main--1.0/src/service/dll/ProtocolNumber.os .build/dbg/openwns-library/library--main--1.0/src/service/tl/tests/PortPoolTest.os .build/dbg/openwns-library/library--main--1.0/src/service/phy/phymode/SNR2MIInterface.os .build/dbg/openwns-library/library--main--1.0/src/service/phy/phymode/MI2PERInterface.os .build/dbg/openwns-library/library--main--1.0/src/service/phy/phymode/PhyModeMapperInterface.os .build/dbg/openwns-library/library--main--1.0/src/scheduler/grouper/NoGrouper.os .build/dbg/openwns-library/library--main--1.0/src/scheduler/grouper/SpatialGrouper.os .build/dbg/openwns-library/library--main--1.0/src/scheduler/grouper/TrivialGrouper.os .build/dbg/openwns-library/library--main--1.0/src/scheduler/grouper/RelayMetaGrouper.os .build/dbg/openwns-library/library--main--1.0/src/scheduler/grouper/AllPossibleGroupsGrouper.os .build/dbg/openwns-library/library--main--1.0/src/scheduler/grouper/OptimalGrouper.os .build/dbg/openwns-library/library--main--1.0/src/scheduler/grouper/GreedyGrouper.os .build/dbg/openwns-library/library--main--1.0/src/scheduler/grouper/TreeBasedGrouper.os .build/dbg/openwns-library/library--main--1.0/src/scheduler/grouper/SINRHeuristic.os .build/dbg/openwns-library/library--main--1.0/src/scheduler/grouper/RelayPreferredSINRHeuristic.os .build/dbg/openwns-library/library--main--1.0/src/scheduler/grouper/DoAGrouper.os .build/dbg/openwns-library/library--main--1.0/src/scheduler/grouper/DoAHeuristicLinearCost.os .build/dbg/openwns-library/library--main--1.0/src/scheduler/grouper/DoAHeuristicPreferredAngle.os .build/dbg/openwns-library/library--main--1.0/src/scheduler/MapInfoEntry.os .build/dbg/openwns-library/library--main--1.0/src/scheduler/SchedulingMap.os .build/dbg/openwns-library/library--main--1.0/src/scheduler/strategy/StrategyInterface.os .build/dbg/openwns-library/library--main--1.0/src/scheduler/strategy/Strategy.os .build/dbg/openwns-library/library--main--1.0/src/scheduler/strategy/SchedulerState.os .build/dbg/openwns-library/library--main--1.0/src/scheduler/strategy/RoundRobinUL.os .build/dbg/openwns-library/library--main--1.0/src/scheduler/strategy/CQIEnabledRoundRobinUL.os .build/dbg/openwns-library/library--main--1.0/src/scheduler/strategy/PCRR.os .build/dbg/openwns-library/library--main--1.0/src/scheduler/strategy/EqualTimeRR.os .build/dbg/openwns-library/library--main--1.0/src/scheduler/strategy/ExhaustiveRR.os .build/dbg/openwns-library/library--main--1.0/src/scheduler/strategy/ExhaustiveRRUL.os .build/dbg/openwns-library/library--main--1.0/src/scheduler/strategy/CQIEnabledExhaustiveRR.os .build/dbg/openwns-library/library--main--1.0/src/scheduler/strategy/ProportionalFairBase.os .build/dbg/openwns-library/library--main--1.0/src/scheduler/strategy/ProportionalFairDL.os .build/dbg/openwns-library/library--main--1.0/src/scheduler/strategy/ProportionalFairUL.os .build/dbg/openwns-library/library--main--1.0/src/scheduler/strategy/RelayPreferredRR.os .build/dbg/openwns-library/library--main--1.0/src/scheduler/strategy/staticpriority/SubStrategy.os .build/dbg/openwns-library/library--main--1.0/src/scheduler/strategy/staticpriority/RoundRobin.os .build/dbg/openwns-library/library--main--1.0/src/scheduler/strategy/staticpriority/ExhaustiveRoundRobin.os .build/dbg/openwns-library/library--main--1.0/src/scheduler/strategy/StaticPriority.os .build/dbg/openwns-library/library--main--1.0/src/scheduler/strategy/dsastrategy/DSAStrategy.os .build/dbg/openwns-library/library--main--1.0/src/scheduler/strategy/dsastrategy/DoNotUseDSA.os .build/dbg/openwns-library/library--main--1.0/src/scheduler/strategy/dsastrategy/LinearFFirst.os .build/dbg/openwns-library/library--main--1.0/src/scheduler/strategy/dsastrategy/BestChannel.os .build/dbg/openwns-library/library--main--1.0/src/scheduler/strategy/dsastrategy/BestCapacity.os .build/dbg/openwns-library/library--main--1.0/src/scheduler/strategy/dsastrategy/InterferenceCoordinatedSimple.os .build/dbg/openwns-library/library--main--1.0/src/scheduler/strategy/apcstrategy/APCStrategy.os .build/dbg/openwns-library/library--main--1.0/src/scheduler/strategy/apcstrategy/DoNotUseAPC.os .build/dbg/openwns-library/library--main--1.0/src/scheduler/strategy/apcstrategy/UseNominalTxPower.os .build/dbg/openwns-library/library--main--1.0/src/scheduler/strategy/apcstrategy/FCFSMaxPhyMode.os .build/dbg/openwns-library/library--main--1.0/src/scheduler/strategy/apcstrategy/FairSINR.os .build/dbg/openwns-library/library--main--1.0/src/scheduler/queue/SimpleQueue.os .build/dbg/openwns-library/library--main--1.0/src/scheduler/queue/SegmentingQueue.os .build/dbg/openwns-library/library--main--1.0/src/scheduler/strategy/tests/StrategyTest.os .build/dbg/openwns-library/library--main--1.0/src/scheduler/tests/PhyModeStub.os .build/dbg/openwns-library/library--main--1.0/src/scheduler/tests/PhyModeMapperStub.os .build/dbg/openwns-library/library--main--1.0/src/scheduler/tests/RegistryProxyStub.os .build/dbg/openwns-library/library--main--1.0/src/scheduler/grouper/tests/GrouperStub.os .build/dbg/openwns-library/library--main--1.0/src/scheduler/strategy/tests/ResultsContainer.os .build/dbg/openwns-library/library--main--1.0/src/scheduler/queue/tests/SimpleQueueTest.os .build/dbg/openwns-library/library--main--1.0/src/scheduler/tests/ClassifierPolicyDropIn.os .build/dbg/openwns-library/library--main--1.0/src/distribution/tests/FixedTest.os .build/dbg/openwns-library/library--main--1.0/src/distribution/tests/VarEstimator.os .build/dbg/openwns-library/library--main--1.0/src/distribution/tests/NegExpTest.os .build/dbg/openwns-library/library--main--1.0/src/distribution/tests/ErlangTest.os .build/dbg/openwns-library/library--main--1.0/src/distribution/tests/NormTest.os .build/dbg/openwns-library/library--main--1.0/src/distribution/tests/UniformTest.os .build/dbg/openwns-library/library--main--1.0/src/distribution/tests/DiscreteUniformTest.os .build/dbg/openwns-library/library--main--1.0/src/distribution/tests/PoissonTest.os .build/dbg/openwns-library/library--main--1.0/src/distribution/tests/GeometricTest.os .build/dbg/openwns-library/library--main--1.0/src/distribution/tests/ParetoTest.os .build/dbg/openwns-library/library--main--1.0/src/distribution/tests/BinomialTest.os .build/dbg/openwns-library/library--main--1.0/src/distribution/tests/CDFTableTest.os .build/dbg/openwns-library/library--main--1.0/src/distribution/tests/RiceTest.os .build/dbg/openwns-library/library--main--1.0/src/distribution/tests/TimeDependentTest.os .build/dbg/openwns-library/library--main--1.0/src/distribution/tests/OperationTest.os .build/dbg/openwns-library/library--main--1.0/src/geometry/Point.os .build/dbg/openwns-library/library--main--1.0/src/geometry/Vector.os .build/dbg/openwns-library/library--main--1.0/src/geometry/Shape2D.os .build/dbg/openwns-library/library--main--1.0/src/geometry/AABoundingBox.os .build/dbg/openwns-library/library--main--1.0/src/geometry/LineSegment.os .build/dbg/openwns-library/library--main--1.0/src/geometry/AxisParallelRectangle.os .build/dbg/openwns-library/library--main--1.0/src/geometry/tests/PointTest.os .build/dbg/openwns-library/library--main--1.0/src/geometry/tests/VectorTest.os .build/dbg/openwns-library/library--main--1.0/src/geometry/tests/LineSegmentTest.os .build/dbg/openwns-library/library--main--1.0/src/geometry/tests/AABoundingBoxTest.os .build/dbg/openwns-library/library--main--1.0/src/geometry/tests/AxisParallelRectangleTest.os .build/dbg/openwns-library/library--main--1.0/src/markovchain/tests/MarkovBaseTest.os .build/dbg/openwns-library/library--main--1.0/src/markovchain/tests/MarkovDiscreteTimeTest.os .build/dbg/openwns-library/library--main--1.0/src/markovchain/tests/MarkovContinuousTimeTest.os .build/dbg/openwns-library/library--main--1.0/src/markovchain/tests/MarkovContinuousTimeTrafficTest.os .build/dbg/openwns-library/library--main--1.0/src/markovchain/tests/MarkovDiscreteTimeTrafficTest.os .build/dbg/openwns-library/library--main--1.0/src/ldk/FunctionalUnit.os .build/dbg/openwns-library/library--main--1.0/src/ldk/CommandTypeSpecifier.os .build/dbg/openwns-library/library--main--1.0/src/ldk/Compound.os .build/dbg/openwns-library/library--main--1.0/src/ldk/CommandPool.os .build/dbg/openwns-library/library--main--1.0/src/ldk/CommandProxy.os .build/dbg/openwns-library/library--main--1.0/src/ldk/RandomAccessLink.os .build/dbg/openwns-library/library--main--1.0/src/ldk/SingleLink.os .build/dbg/openwns-library/library--main--1.0/src/ldk/SingleReceptor.os .build/dbg/openwns-library/library--main--1.0/src/ldk/SingleConnector.os .build/dbg/openwns-library/library--main--1.0/src/ldk/SingleDeliverer.os .build/dbg/openwns-library/library--main--1.0/src/ldk/MultiLink.os .build/dbg/openwns-library/library--main--1.0/src/ldk/FirstServeConnector.os .build/dbg/openwns-library/library--main--1.0/src/ldk/RoundRobinLink.os .build/dbg/openwns-library/library--main--1.0/src/ldk/RoundRobinReceptor.os .build/dbg/openwns-library/library--main--1.0/src/ldk/RoundRobinConnector.os .build/dbg/openwns-library/library--main--1.0/src/ldk/RoundRobinDeliverer.os .build/dbg/openwns-library/library--main--1.0/src/ldk/FlowSeparator.os .build/dbg/openwns-library/library--main--1.0/src/ldk/FlowGate.os .build/dbg/openwns-library/library--main--1.0/src/ldk/Group.os .build/dbg/openwns-library/library--main--1.0/src/ldk/SequentlyCallingLinkHandler.os .build/dbg/openwns-library/library--main--1.0/src/ldk/SimpleLinkHandler.os .build/dbg/openwns-library/library--main--1.0/src/ldk/SuspendSupport.os .build/dbg/openwns-library/library--main--1.0/src/ldk/ManagementServiceInterface.os .build/dbg/openwns-library/library--main--1.0/src/ldk/ControlServiceInterface.os .build/dbg/openwns-library/library--main--1.0/src/ldk/fun/Main.os .build/dbg/openwns-library/library--main--1.0/src/ldk/fun/Sub.os .build/dbg/openwns-library/library--main--1.0/src/ldk/utils.os .build/dbg/openwns-library/library--main--1.0/src/ldk/buffer/Buffer.os .build/dbg/openwns-library/library--main--1.0/src/ldk/buffer/Bounded.os .build/dbg/openwns-library/library--main--1.0/src/ldk/buffer/Dropping.os .build/dbg/openwns-library/library--main--1.0/src/ldk/arq/None.os .build/dbg/openwns-library/library--main--1.0/src/ldk/arq/StopAndWait.os .build/dbg/openwns-library/library--main--1.0/src/ldk/arq/CumulativeACK.os .build/dbg/openwns-library/library--main--1.0/src/ldk/arq/SelectiveRepeat.os .build/dbg/openwns-library/library--main--1.0/src/ldk/arq/GoBackN.os .build/dbg/openwns-library/library--main--1.0/src/ldk/arq/PiggyBacker.os .build/dbg/openwns-library/library--main--1.0/src/ldk/arq/statuscollector/None.os .build/dbg/openwns-library/library--main--1.0/src/ldk/arq/statuscollector/Counter.os .build/dbg/openwns-library/library--main--1.0/src/ldk/arq/statuscollector/TwoSizesWindowed.os .build/dbg/openwns-library/library--main--1.0/src/ldk/harq/HARQ.os .build/dbg/openwns-library/library--main--1.0/src/ldk/harq/softcombining/Container.os .build/dbg/openwns-library/library--main--1.0/src/ldk/harq/softcombining/UniformRandomDecoder.os .build/dbg/openwns-library/library--main--1.0/src/ldk/crc/CRC.os .build/dbg/openwns-library/library--main--1.0/src/ldk/crc/CRCFilter.os .build/dbg/openwns-library/library--main--1.0/src/ldk/sar/Fixed.os .build/dbg/openwns-library/library--main--1.0/src/ldk/sar/Soft.os .build/dbg/openwns-library/library--main--1.0/src/ldk/concatenation/Concatenation.os .build/dbg/openwns-library/library--main--1.0/src/ldk/tools/Synchronizer.os .build/dbg/openwns-library/library--main--1.0/src/ldk/tools/Bridge.os .build/dbg/openwns-library/library--main--1.0/src/ldk/tools/Stub.os .build/dbg/openwns-library/library--main--1.0/src/ldk/tools/PERProviderStub.os .build/dbg/openwns-library/library--main--1.0/src/ldk/tools/Forwarder.os .build/dbg/openwns-library/library--main--1.0/src/ldk/tools/Padding.os .build/dbg/openwns-library/library--main--1.0/src/ldk/tools/Gate.os .build/dbg/openwns-library/library--main--1.0/src/ldk/tools/Stutter.os .build/dbg/openwns-library/library--main--1.0/src/ldk/tools/BottleNeckDetective.os .build/dbg/openwns-library/library--main--1.0/src/ldk/tools/Overhead.os .build/dbg/openwns-library/library--main--1.0/src/ldk/tools/Consumer.os .build/dbg/openwns-library/library--main--1.0/src/ldk/tools/ConstantDelay.os .build/dbg/openwns-library/library--main--1.0/src/ldk/probe/Packet.os .build/dbg/openwns-library/library--main--1.0/src/ldk/probe/Window.os .build/dbg/openwns-library/library--main--1.0/src/ldk/probe/ErrorRate.os .build/dbg/openwns-library/library--main--1.0/src/ldk/probe/bus/Packet.os .build/dbg/openwns-library/library--main--1.0/src/ldk/probe/bus/Window.os .build/dbg/openwns-library/library--main--1.0/src/ldk/command/FlowControl.os .build/dbg/openwns-library/library--main--1.0/src/ldk/multiplexer/Dispatcher.os .build/dbg/openwns-library/library--main--1.0/src/ldk/multiplexer/FrameDispatcher.os .build/dbg/openwns-library/library--main--1.0/src/ldk/multiplexer/OpcodeProvider.os .build/dbg/openwns-library/library--main--1.0/src/ldk/multiplexer/OpcodeDeliverer.os .build/dbg/openwns-library/library--main--1.0/src/ldk/multiplexer/OpcodeSetter.os .build/dbg/openwns-library/library--main--1.0/src/ldk/multiplexer/OpcodeKey.os .build/dbg/openwns-library/library--main--1.0/src/ldk/fcf/FrameBuilder.os .build/dbg/openwns-library/library--main--1.0/src/ldk/fcf/PhaseDescriptor.os .build/dbg/openwns-library/library--main--1.0/src/ldk/fcf/TimingControl.os .build/dbg/openwns-library/library--main--1.0/src/ldk/fcf/NewFrameProviderObserver.os .build/dbg/openwns-library/library--main--1.0/src/ldk/flowseparator/NotFoundStrategy.os .build/dbg/openwns-library/library--main--1.0/src/ldk/flowseparator/CreatorStrategy.os .build/dbg/openwns-library/library--main--1.0/src/ldk/tests/LayerTest.os .build/dbg/openwns-library/library--main--1.0/src/ldk/tests/LayerStub.os .build/dbg/openwns-library/library--main--1.0/src/ldk/tests/FunctionalUnitTest.os .build/dbg/openwns-library/library--main--1.0/src/ldk/tests/RoundRobinLinkTest.os .build/dbg/openwns-library/library--main--1.0/src/ldk/tests/RandomAccessLinkTest.os .build/dbg/openwns-library/library--main--1.0/src/ldk/tests/SingleLinkTest.os.build/dbg/openwns-library/library--main--1.0/src/ldk/tests/SingleReceptorTest.os .build/dbg/openwns-library/library--main--1.0/src/ldk/tests/SingleConnectorTest.os .build/dbg/openwns-library/library--main--1.0/src/ldk/tests/SingleDelivererTest.os .build/dbg/openwns-library/library--main--1.0/src/ldk/tests/MultiLinkTest.os .build/dbg/openwns-library/library--main--1.0/src/ldk/tests/FirstServeConnectorTest.os .build/dbg/openwns-library/library--main--1.0/src/ldk/tests/RoundRobinReceptorTest.os .build/dbg/openwns-library/library--main--1.0/src/ldk/tests/RoundRobinConnectorTest.os .build/dbg/openwns-library/library--main--1.0/src/ldk/tests/RoundRobinDelivererTest.os .build/dbg/openwns-library/library--main--1.0/src/ldk/tests/FlowSeparatorTest.os .build/dbg/openwns-library/library--main--1.0/src/ldk/tests/FlowGateTest.os .build/dbg/openwns-library/library--main--1.0/src/ldk/tests/GroupTest.os .build/dbg/openwns-library/library--main--1.0/src/ldk/tests/GroupFlowSeparatorTest.os .build/dbg/openwns-library/library--main--1.0/src/ldk/tests/SpeedTest.os .build/dbg/openwns-library/library--main--1.0/src/ldk/tests/SizeCalculationTest.os.build/dbg/openwns-library/library--main--1.0/src/ldk/tests/DropperTest.os .build/dbg/openwns-library/library--main--1.0/src/ldk/tests/ClassifierTest.os .build/dbg/openwns-library/library--main--1.0/src/ldk/tests/FUTestBase.os .build/dbg/openwns-library/library--main--1.0/src/ldk/tests/FUTestBaseTest.os .build/dbg/openwns-library/library--main--1.0/src/ldk/tests/DelayedInterfaceTest.os .build/dbg/openwns-library/library--main--1.0/src/ldk/tests/CommandProxyTest.os .build/dbg/openwns-library/library--main--1.0/src/ldk/fun/tests/FUNTest.os .build/dbg/openwns-library/library--main--1.0/src/ldk/fun/tests/MainTest.os .build/dbg/openwns-library/library--main--1.0/src/ldk/fun/tests/MainGenericTest.os .build/dbg/openwns-library/library--main--1.0/src/ldk/fun/tests/SubTest.os .build/dbg/openwns-library/library--main--1.0/src/ldk/fsm/tests/FunctionalUnitTest.os .build/dbg/openwns-library/library--main--1.0/src/ldk/arq/tests/NoneTest.os .build/dbg/openwns-library/library--main--1.0/src/ldk/arq/tests/StopAndWaitTest.os .build/dbg/openwns-library/library--main--1.0/src/ldk/arq/tests/CumulativeACKTest.os .build/dbg/openwns-library/library--main--1.0/src/ldk/arq/tests/SelectiveRepeatTest.os .build/dbg/openwns-library/library--main--1.0/src/ldk/arq/tests/GoBackNTest.os .build/dbg/openwns-library/library--main--1.0/src/ldk/arq/tests/PiggyBackerTest.os .build/dbg/openwns-library/library--main--1.0/src/ldk/harq/softcombining/tests/ContainerTest.os .build/dbg/openwns-library/library--main--1.0/src/ldk/crc/tests/CRCTest.os .build/dbg/openwns-library/library--main--1.0/src/ldk/crc/tests/CRCFilterTest.os .build/dbg/openwns-library/library--main--1.0/src/ldk/buffer/tests/BoundedTest.os .build/dbg/openwns-library/library--main--1.0/src/ldk/buffer/tests/DroppingTest.os .build/dbg/openwns-library/library--main--1.0/src/ldk/sar/tests/FixedTest.os .build/dbg/openwns-library/library--main--1.0/src/ldk/tools/tests/ForwarderTest.os .build/dbg/openwns-library/library--main--1.0/src/ldk/tools/tests/ProducerTest.os .build/dbg/openwns-library/library--main--1.0/src/ldk/tools/tests/ConsumerTest.os .build/dbg/openwns-library/library--main--1.0/src/ldk/tools/tests/BridgeTest.os .build/dbg/openwns-library/library--main--1.0/src/ldk/tools/tests/SynchronizerTest.os .build/dbg/openwns-library/library--main--1.0/src/ldk/tools/tests/PaddingTest.os .build/dbg/openwns-library/library--main--1.0/src/ldk/tools/tests/GateTest.os .build/dbg/openwns-library/library--main--1.0/src/ldk/tools/tests/OverheadTest.os .build/dbg/openwns-library/library--main--1.0/src/ldk/multiplexer/tests/OpcodeDelivererTest.os .build/dbg/openwns-library/library--main--1.0/src/ldk/multiplexer/tests/OpcodeTest.os .build/dbg/openwns-library/library--main--1.0/src/ldk/multiplexer/tests/DispatcherTest.os .build/dbg/openwns-library/library--main--1.0/src/ldk/multiplexer/tests/FrameDispatcherTest.os .build/dbg/openwns-library/library--main--1.0/src/ldk/fcf/tests/NewFrameProviderObserverTest.os .build/dbg/openwns-library/library--main--1.0/src/ldk/probe/tests/PacketTest.os .build/dbg/openwns-library/library--main--1.0/src/ldk/probe/tests/WindowTest.os .build/dbg/openwns-library/library--main--1.0/src/fsm/tests/FSMTest.os -Lsandbox/dbg/lib
> collect2: ld terminated with signal 9 [Killed]
> scons: *** [.build/dbg/openwns-library/library--main--1.0/libwns.so] Error 1
> scons: building terminated because of errors.
> poporong@andLinux:~/openwns-sdk$
>
> Sorry for this ... Thank you
>
> Rong
>
>

Rong (poporong) said : #4

1) I am using Ubuntu but with andLinux on windows
2) The gcc/g++ version is 4.3.3 and ld version is 2.19.1
3) I have tried the links you sent and the toolchain works OK

However, as the memory requirement is large, could this be the problem of VM? Another thing is that in order to run andlinux, usually, a addServer is needed to run.

Thanks again

Rong

Dear Rong,

It think that the error you get is related to andLinux rather than to
openWNS.

Can you try to increase the memory assigned to the andLinux VM?

Regards,
  Daniel

Rong wrote:
> Question #75185 on openWNS SDK changed:
> https://answers.launchpad.net/openwns-sdk/+question/75185
>
> Status: Answered => Open
>
> Rong is still having a problem:
> 1) I am using Ubuntu but with andLinux on windows
> 2) The gcc/g++ version is 4.3.3 and ld version is 2.19.1
> 3) I have tried the links you sent and the toolchain works OK
>
> However, as the memory requirement is large, could this be the problem
> of VM? Another thing is that in order to run andlinux, usually, a
> addServer is needed to run.
>
> Thanks again
>
> Rong
>
>

--
---

Dipl.-Ing. Daniel Bültmann
Communication Networks (ComNets), Aachen University

 mail ° <email address hidden>
 room ° OG 110
phone ° +49 (0)241 80 27911
      °

Tuul (mgsin30-mgcos30) said : #6

I'm found the same problem as Rong. During the build process I found

ct2: ld terminated with signal 9 [Killed]
scons: *** [.build/dbg/openwns-library/libwns.so] Error 1
scons: building terminated because of errors.

My systems is Ubuntu 9.10 on VMware
My gcc/g++ is 4.4.1 and ld version is 2.20
I'm also tried the link above and everything is ok.

However, I set the memory for VM machine to 512 MB and I'm not sure that this lead to the problem. I'll try to increase the memory of VM machine before next compilation.

Thanks

Hi,

I would highly suggest you stick to Ubuntu 8.10 or even 8.04 (LTS). Go
to http://www.ubuntu.com/getubuntu/download and select "***Alternative
download options, including Ubuntu installer for Windows
<http://www.ubuntu.com/getubuntu/download#>" here you can select 8.04.
We are currently finishing adjustments for Ubuntu 9.04. We still have
some issues with 9.10.

512 MB should be just enough for openWNS on a VM. A little more could be
necessary if you get out of memory errors.

Greats,

Maciej Muehleisen
*
Tuul wrote:
> Question #75185 on openWNS SDK changed:
> https://answers.launchpad.net/openwns-sdk/+question/75185
>
> Tuul posted a new comment:
> I'm found the same problem as Rong. During the build process I found
>
> ct2: ld terminated with signal 9 [Killed]
> scons: *** [.build/dbg/openwns-library/libwns.so] Error 1
> scons: building terminated because of errors.
>
> My systems is Ubuntu 9.10 on VMware
> My gcc/g++ is 4.4.1 and ld version is 2.20
> I'm also tried the link above and everything is ok.
>
> However, I set the memory for VM machine to 512 MB and I'm not sure that
> this lead to the problem. I'll try to increase the memory of VM machine
> before next compilation.
>
> Thanks
>
>

Can you help with this problem?

Provide an answer of your own, or ask Rong for more information if necessary.

To post a message you must log in.