error while running madgraph

Asked by Sihyun Jeon on 2018-03-10

Hi MadGraph authors,

I have been receiving this error message and I don't have any clue what the problem is.

Please take a look and help me with this issue!

Thanks, Sihyun Jeon.

#************************************************************
#* MadGraph5_aMC@NLO *
#* *
#* * * *
#* * * * * *
#* * * * * 5 * * * * *
#* * * * * *
#* * * *
#* *
#* *
#* VERSION 2.6.0 2017-08-16 *
#* *
#* The MadGraph5_aMC@NLO Development Team - Find us at *
#* https://server06.fynu.ucl.ac.be/projects/madgraph *
#* and *
#* http://amcatnlo.cern.ch *
#* *
#************************************************************
#* *
#* Command File for aMCatNLO *
#* *
#* run as ./bin/aMCatNLO.py filename *
#* *
#************************************************************
launch auto
Traceback (most recent call last):
  File "/data9/Users/shjeon/gridpack_MG5_aMC_v2_6_0_copy1/MG5_aMC_v2_6_0/madgraph/interface/extended_cmd.py", line 1438, in onecmd
    return self.onecmd_orig(line, **opt)
  File "/data9/Users/shjeon/gridpack_MG5_aMC_v2_6_0_copy1/MG5_aMC_v2_6_0/madgraph/interface/extended_cmd.py", line 1392, in onecmd_orig
    return func(arg, **opt)
  File "/data9/Users/shjeon/gridpack_MG5_aMC_v2_6_0_copy1/MG5_aMC_v2_6_0/madgraph/interface/amcatnlo_run_interface.py", line 1228, in do_launch
    self.compile(mode, options)
  File "/data9/Users/shjeon/gridpack_MG5_aMC_v2_6_0_copy1/MG5_aMC_v2_6_0/madgraph/interface/amcatnlo_run_interface.py", line 4595, in compile
    misc.compile(cwd = sourcedir)
  File "/data9/Users/shjeon/gridpack_MG5_aMC_v2_6_0_copy1/MG5_aMC_v2_6_0/madgraph/various/misc.py", line 479, in compile
    raise MadGraph5Error, error_text
MadGraph5Error: A compilation Error occurs when trying to compile /data9/Users/shjeon/gridpack_MG5_aMC_v2_6_0_copy1/MG5_aMC_v2_6_0/WRToNLep_MuMuJJ_WR400_N100_Tchannel_NLO/Source.
The compilation fails with the following output message:
    rm -f ../lib/libdhelas.a
    cd DHELAS; make
    make[1]: Entering directory `/data9/Users/shjeon/gridpack_MG5_aMC_v2_6_0_copy1/MG5_aMC_v2_6_0/WRToNLep_MuMuJJ_WR400_N100_Tchannel_NLO/Source/DHELAS'
    gfortran -O -fno-automatic -ffixed-line-length-132 -c -o aloha_functions.o aloha_functions.f
    aloha_functions.f:483.25:

                ip = nhel * -1 * ((1-nh)/2)
                             1
    Warning: Extension: Unary operator following arithmetic operator (use parentheses) at (1)
    aloha_functions.f:2307.27:

              CALL ILXXXX(Q(0),M,-1,1,W(1))
                               1
    Warning: Type mismatch in argument 'ffmass' at (1); passed COMPLEX(8) to REAL(8)
    aloha_functions.f:2310.27:

              CALL ILXXXX(Q(0),M,-1,-1,W(1))
                               1
    Warning: Type mismatch in argument 'ffmass' at (1); passed COMPLEX(8) to REAL(8)
    aloha_functions.f:2318.27:

              CALL ILXXXX(Q(0),M,1,1,W(1))
                               1
    Warning: Type mismatch in argument 'ffmass' at (1); passed COMPLEX(8) to REAL(8)
    aloha_functions.f:2321.27:

              CALL ILXXXX(Q(0),M,1,-1,W(1))
                               1
    Warning: Type mismatch in argument 'ffmass' at (1); passed COMPLEX(8) to REAL(8)
    aloha_functions.f:2326.27:

              CALL OLXXXX(Q(0),M,-1,-1,W(1))
                               1
    Warning: Type mismatch in argument 'ffmass' at (1); passed COMPLEX(8) to REAL(8)
    aloha_functions.f:2329.27:

              CALL OLXXXX(Q(0),M,-1,1,W(1))
                               1
    Warning: Type mismatch in argument 'ffmass' at (1); passed COMPLEX(8) to REAL(8)
    aloha_functions.f:2334.27:

              CALL OLXXXX(Q(0),M,1,-1,W(1))
                               1
    Warning: Type mismatch in argument 'ffmass' at (1); passed COMPLEX(8) to REAL(8)
    aloha_functions.f:2337.27:

              CALL OLXXXX(Q(0),M,1,1,W(1))
                               1
    Warning: Type mismatch in argument 'ffmass' at (1); passed COMPLEX(8) to REAL(8)
    aloha_functions.f:2567.27:

              CALL ICLXXX(Q(0),M,-1,1,W(1))
                               1
    Warning: Type mismatch in argument 'ffmass' at (1); passed COMPLEX(8) to REAL(8)
    aloha_functions.f:2570.27:

              CALL ICLXXX(Q(0),M,-1,-1,W(1))
                               1
    Warning: Type mismatch in argument 'ffmass' at (1); passed COMPLEX(8) to REAL(8)
    aloha_functions.f:2575.27:

              CALL ICLXXX(Q(0),M,1,1,W(1))
                               1
    Warning: Type mismatch in argument 'ffmass' at (1); passed COMPLEX(8) to REAL(8)
    aloha_functions.f:2578.27:

              CALL ICLXXX(Q(0),M,1,-1,W(1))
                               1
    Warning: Type mismatch in argument 'ffmass' at (1); passed COMPLEX(8) to REAL(8)
    aloha_functions.f:2583.27:

              CALL OCLXXX(Q(0),M,-1,-1,W(1))
                               1
    Warning: Type mismatch in argument 'ffmass' at (1); passed COMPLEX(8) to REAL(8)
    aloha_functions.f:2586.27:

              CALL OCLXXX(Q(0),M,-1,1,W(1))
                               1
    Warning: Type mismatch in argument 'ffmass' at (1); passed COMPLEX(8) to REAL(8)
    aloha_functions.f:2591.27:

              CALL OCLXXX(Q(0),M,1,-1,W(1))
                               1
    Warning: Type mismatch in argument 'ffmass' at (1); passed COMPLEX(8) to REAL(8)
    aloha_functions.f:2594.27:

              CALL OCLXXX(Q(0),M,1,1,W(1))
                               1
    Warning: Type mismatch in argument 'ffmass' at (1); passed COMPLEX(8) to REAL(8)
    gfortran -O -fno-automatic -ffixed-line-length-132 -c -o FFV1_3_4_2.o FFV1_3_4_2.f
    gfortran -O -fno-automatic -ffixed-line-length-132 -c -o MP_FFV1_3_4_2.o MP_FFV1_3_4_2.f
    gfortran -O -fno-automatic -ffixed-line-length-132 -c -o FFV4_0.o FFV4_0.f
    gfortran -O -fno-automatic -ffixed-line-length-132 -c -o MP_FFV4_0.o MP_FFV4_0.f
    gfortran -O -fno-automatic -ffixed-line-length-132 -c -o FFV1_2.o FFV1_2.f
    gfortran -O -fno-automatic -ffixed-line-length-132 -c -o MP_FFV1_2.o MP_FFV1_2.f
    gfortran -O -fno-automatic -ffixed-line-length-132 -c -o FFV1_3_4L2P0_3.o FFV1_3_4L2P0_3.f
    gfortran -O -fno-automatic -ffixed-line-length-132 -c -o MP_FFV1_3_4L2P0_3.o MP_FFV1_3_4L2P0_3.f
    gfortran -O -fno-automatic -ffixed-line-length-132 -c -o FFV1L2P0_3.o FFV1L2P0_3.f
    FFV1L2P0_3.f:21.26:

          COEFF(1,0,1)= COUP*-CI * F1(7)
                              1
    Warning: Extension: Unary operator following arithmetic operator (use parentheses) at (1)
    FFV1L2P0_3.f:22.26:

          COEFF(2,0,1)= COUP*-CI * F1(8)
                              1
    Warning: Extension: Unary operator following arithmetic operator (use parentheses) at (1)
    FFV1L2P0_3.f:23.26:

          COEFF(3,0,1)= COUP*-F1(8)
                              1
    Warning: Extension: Unary operator following arithmetic operator (use parentheses) at (1)
    FFV1L2P0_3.f:24.26:

          COEFF(4,0,1)= COUP*-CI * F1(7)
                              1
    Warning: Extension: Unary operator following arithmetic operator (use parentheses) at (1)
    FFV1L2P0_3.f:25.26:

          COEFF(1,0,2)= COUP*-CI * F1(8)
                              1
    Warning: Extension: Unary operator following arithmetic operator (use parentheses) at (1)
    FFV1L2P0_3.f:26.26:

          COEFF(2,0,2)= COUP*-CI * F1(7)
                              1
    Warning: Extension: Unary operator following arithmetic operator (use parentheses) at (1)
    FFV1L2P0_3.f:29.26:

          COEFF(1,0,3)= COUP*-CI * F1(5)
                              1
    Warning: Extension: Unary operator following arithmetic operator (use parentheses) at (1)
    FFV1L2P0_3.f:33.26:

          COEFF(1,0,4)= COUP*-CI * F1(6)
                              1
    Warning: Extension: Unary operator following arithmetic operator (use parentheses) at (1)
    FFV1L2P0_3.f:35.26:

          COEFF(3,0,4)= COUP*-F1(5)
                              1
    Warning: Extension: Unary operator following arithmetic operator (use parentheses) at (1)
    FFV1L2P0_3.f:36.26:

          COEFF(4,0,4)= COUP*-CI * F1(6)
                              1
    Warning: Extension: Unary operator following arithmetic operator (use parentheses) at (1)
    gfortran -O -fno-automatic -ffixed-line-length-132 -c -o MP_FFV1L2P0_3.o MP_FFV1L2P0_3.f
    MP_FFV1L2P0_3.f:21.26:

          COEFF(1,0,1)= COUP*-CI * F1(7)
                              1
    Warning: Extension: Unary operator following arithmetic operator (use parentheses) at (1)
    MP_FFV1L2P0_3.f:22.26:

          COEFF(2,0,1)= COUP*-CI * F1(8)
                              1
    Warning: Extension: Unary operator following arithmetic operator (use parentheses) at (1)
    MP_FFV1L2P0_3.f:23.26:

          COEFF(3,0,1)= COUP*-F1(8)
                              1
    Warning: Extension: Unary operator following arithmetic operator (use parentheses) at (1)
    MP_FFV1L2P0_3.f:24.26:

          COEFF(4,0,1)= COUP*-CI * F1(7)
                              1
    Warning: Extension: Unary operator following arithmetic operator (use parentheses) at (1)
    MP_FFV1L2P0_3.f:25.26:

          COEFF(1,0,2)= COUP*-CI * F1(8)
                              1
    Warning: Extension: Unary operator following arithmetic operator (use parentheses) at (1)
    MP_FFV1L2P0_3.f:26.26:

          COEFF(2,0,2)= COUP*-CI * F1(7)
                              1
    Warning: Extension: Unary operator following arithmetic operator (use parentheses) at (1)
    MP_FFV1L2P0_3.f:29.26:

          COEFF(1,0,3)= COUP*-CI * F1(5)
                              1
    Warning: Extension: Unary operator following arithmetic operator (use parentheses) at (1)
    MP_FFV1L2P0_3.f:33.26:

          COEFF(1,0,4)= COUP*-CI * F1(6)
                              1
    Warning: Extension: Unary operator following arithmetic operator (use parentheses) at (1)
    MP_FFV1L2P0_3.f:35.26:

          COEFF(3,0,4)= COUP*-F1(5)
                              1
    Warning: Extension: Unary operator following arithmetic operator (use parentheses) at (1)
    MP_FFV1L2P0_3.f:36.26:

          COEFF(4,0,4)= COUP*-CI * F1(6)
                              1
    Warning: Extension: Unary operator following arithmetic operator (use parentheses) at (1)
    gfortran -O -fno-automatic -ffixed-line-length-132 -c -o FF1_0.o FF1_0.f
    gfortran -O -fno-automatic -ffixed-line-length-132 -c -o MP_FF1_0.o MP_FF1_0.f
    gfortran -O -fno-automatic -ffixed-line-length-132 -c -o FFV1_3_4L1_2.o FFV1_3_4L1_2.f
    gfortran -O -fno-automatic -ffixed-line-length-132 -c -o MP_FFV1_3_4L1_2.o MP_FFV1_3_4L1_2.f
    gfortran -O -fno-automatic -ffixed-line-length-132 -c -o FFV1L1P0_3.o FFV1L1P0_3.f
    FFV1L1P0_3.f:21.26:

          COEFF(1,0,1)= COUP*-CI * F2(7)
                              1
    Warning: Extension: Unary operator following arithmetic operator (use parentheses) at (1)
    FFV1L1P0_3.f:23.26:

          COEFF(3,0,1)= COUP*-F2(8)
                              1
    Warning: Extension: Unary operator following arithmetic operator (use parentheses) at (1)
    FFV1L1P0_3.f:25.26:

          COEFF(1,0,2)= COUP*-CI * F2(8)
                              1
    Warning: Extension: Unary operator following arithmetic operator (use parentheses) at (1)
    FFV1L1P0_3.f:28.26:

          COEFF(4,0,2)= COUP*-CI * F2(8)
                              1
    Warning: Extension: Unary operator following arithmetic operator (use parentheses) at (1)
    FFV1L1P0_3.f:29.26:

          COEFF(1,0,3)= COUP*-CI * F2(5)
                              1
    Warning: Extension: Unary operator following arithmetic operator (use parentheses) at (1)
    FFV1L1P0_3.f:30.26:

          COEFF(2,0,3)= COUP*-CI * F2(6)
                              1
    Warning: Extension: Unary operator following arithmetic operator (use parentheses) at (1)
    FFV1L1P0_3.f:32.26:

          COEFF(4,0,3)= COUP*-CI * F2(5)
                              1
    Warning: Extension: Unary operator following arithmetic operator (use parentheses) at (1)
    FFV1L1P0_3.f:33.26:

          COEFF(1,0,4)= COUP*-CI * F2(6)
                              1
    Warning: Extension: Unary operator following arithmetic operator (use parentheses) at (1)
    FFV1L1P0_3.f:34.26:

          COEFF(2,0,4)= COUP*-CI * F2(5)
                              1
    Warning: Extension: Unary operator following arithmetic operator (use parentheses) at (1)
    FFV1L1P0_3.f:35.26:

          COEFF(3,0,4)= COUP*-F2(5)
                              1
    Warning: Extension: Unary operator following arithmetic operator (use parentheses) at (1)
    gfortran -O -fno-automatic -ffixed-line-length-132 -c -o MP_FFV1L1P0_3.o MP_FFV1L1P0_3.f
    MP_FFV1L1P0_3.f:21.26:

          COEFF(1,0,1)= COUP*-CI * F2(7)
                              1
    Warning: Extension: Unary operator following arithmetic operator (use parentheses) at (1)
    MP_FFV1L1P0_3.f:23.26:

          COEFF(3,0,1)= COUP*-F2(8)
                              1
    Warning: Extension: Unary operator following arithmetic operator (use parentheses) at (1)
    MP_FFV1L1P0_3.f:25.26:

          COEFF(1,0,2)= COUP*-CI * F2(8)
                              1
    Warning: Extension: Unary operator following arithmetic operator (use parentheses) at (1)
    MP_FFV1L1P0_3.f:28.26:

          COEFF(4,0,2)= COUP*-CI * F2(8)
                              1
    Warning: Extension: Unary operator following arithmetic operator (use parentheses) at (1)
    MP_FFV1L1P0_3.f:29.26:

          COEFF(1,0,3)= COUP*-CI * F2(5)
                              1
    Warning: Extension: Unary operator following arithmetic operator (use parentheses) at (1)
    MP_FFV1L1P0_3.f:30.26:

          COEFF(2,0,3)= COUP*-CI * F2(6)
                              1
    Warning: Extension: Unary operator following arithmetic operator (use parentheses) at (1)
    MP_FFV1L1P0_3.f:32.26:

          COEFF(4,0,3)= COUP*-CI * F2(5)
                              1
    Warning: Extension: Unary operator following arithmetic operator (use parentheses) at (1)
    MP_FFV1L1P0_3.f:33.26:

          COEFF(1,0,4)= COUP*-CI * F2(6)
                              1
    Warning: Extension: Unary operator following arithmetic operator (use parentheses) at (1)
    MP_FFV1L1P0_3.f:34.26:

          COEFF(2,0,4)= COUP*-CI * F2(5)
                              1
    Warning: Extension: Unary operator following arithmetic operator (use parentheses) at (1)
    MP_FFV1L1P0_3.f:35.26:

          COEFF(3,0,4)= COUP*-F2(5)
                              1
    Warning: Extension: Unary operator following arithmetic operator (use parentheses) at (1)
    gfortran -O -fno-automatic -ffixed-line-length-132 -c -o FFV3_0.o FFV3_0.f
    gfortran -O -fno-automatic -ffixed-line-length-132 -c -o MP_FFV3_0.o MP_FFV3_0.f
    gfortran -O -fno-automatic -ffixed-line-length-132 -c -o FFV1L3_2.o FFV1L3_2.f
    FFV1L3_2.f:29.26:

          COEFF(1,1,1)= COUP*-CI * F1(5)
                              1
    Warning: Extension: Unary operator following arithmetic operator (use parentheses) at (1)
    FFV1L3_2.f:30.26:

          COEFF(2,1,1)= COUP*-CI * F1(6)
                              1
    Warning: Extension: Unary operator following arithmetic operator (use parentheses) at (1)
    FFV1L3_2.f:31.26:

          COEFF(3,1,1)= COUP*-CI * F1(7)
                              1
    Warning: Extension: Unary operator following arithmetic operator (use parentheses) at (1)
    FFV1L3_2.f:32.26:

          COEFF(4,1,1)= COUP*-CI * F1(8)
                              1
    Warning: Extension: Unary operator following arithmetic operator (use parentheses) at (1)
    FFV1L3_2.f:35.26:

          COEFF(3,2,1)= COUP*-CI * F1(8)
                              1
    Warning: Extension: Unary operator following arithmetic operator (use parentheses) at (1)
    FFV1L3_2.f:36.26:

          COEFF(4,2,1)= COUP*-CI * F1(7)
                              1
    Warning: Extension: Unary operator following arithmetic operator (use parentheses) at (1)
    FFV1L3_2.f:38.26:

          COEFF(2,3,1)= COUP*-F1(5)
                              1
    Warning: Extension: Unary operator following arithmetic operator (use parentheses) at (1)
    FFV1L3_2.f:39.26:

          COEFF(3,3,1)= COUP*-F1(8)
                              1
    Warning: Extension: Unary operator following arithmetic operator (use parentheses) at (1)
    FFV1L3_2.f:42.26:

          COEFF(2,4,1)= COUP*-CI * F1(6)
                              1
    Warning: Extension: Unary operator following arithmetic operator (use parentheses) at (1)
    FFV1L3_2.f:43.26:

          COEFF(3,4,1)= COUP*-CI * F1(7)
                              1
    Warning: Extension: Unary operator following arithmetic operator (use parentheses) at (1)
    FFV1L3_2.f:53.26:

          COEFF(1,1,2)= COUP*-CI * F1(6)
                              1
    Warning: Extension: Unary operator following arithmetic operator (use parentheses) at (1)
    FFV1L3_2.f:54.26:

          COEFF(2,1,2)= COUP*-CI * F1(5)
                              1
    Warning: Extension: Unary operator following arithmetic operator (use parentheses) at (1)
    FFV1L3_2.f:62.26:

          COEFF(2,3,2)= COUP*-F1(6)
                              1
    Warning: Extension: Unary operator following arithmetic operator (use parentheses) at (1)
    FFV1L3_2.f:64.26:

          COEFF(4,3,2)= COUP*-F1(8)
                              1
    Warning: Extension: Unary operator following arithmetic operator (use parentheses) at (1)
    FFV1L3_2.f:66.26:

          COEFF(2,4,2)= COUP*-CI * F1(5)
                              1
    Warning: Extension: Unary operator following arithmetic operator (use parentheses) at (1)
    FFV1L3_2.f:68.26:

          COEFF(4,4,2)= COUP*-CI * F1(7)
                              1
    Warning: Extension: Unary operator following arithmetic operator (use parentheses) at (1)
    FFV1L3_2.f:77.26:

          COEFF(1,1,3)= COUP*-F1(6)
                              1
    Warning: Extension: Unary operator following arithmetic operator (use parentheses) at (1)
    FFV1L3_2.f:80.26:

          COEFF(4,1,3)= COUP*-F1(7)
                              1
    Warning: Extension: Unary operator following arithmetic operator (use parentheses) at (1)
    FFV1L3_2.f:81.26:

          COEFF(1,2,3)= COUP*-F1(5)
                              1
    Warning: Extension: Unary operator following arithmetic operator (use parentheses) at (1)
    FFV1L3_2.f:83.26:

          COEFF(3,2,3)= COUP*-F1(7)
                              1
    Warning: Extension: Unary operator following arithmetic operator (use parentheses) at (1)
    FFV1L3_2.f:101.26:

          COEFF(1,1,4)= COUP*-CI * F1(5)
                              1
    Warning: Extension: Unary operator following arithmetic operator (use parentheses) at (1)
    FFV1L3_2.f:104.26:

          COEFF(4,1,4)= COUP*-CI * F1(8)
                              1
    Warning: Extension: Unary operator following arithmetic operator (use parentheses) at (1)
    FFV1L3_2.f:105.26:

          COEFF(1,2,4)= COUP*-CI * F1(6)
                              1
    Warning: Extension: Unary operator following arithmetic operator (use parentheses) at (1)
    FFV1L3_2.f:107.26:

          COEFF(3,2,4)= COUP*-CI * F1(8)
                              1
    Warning: Extension: Unary operator following arithmetic operator (use parentheses) at (1)
    FFV1L3_2.f:109.26:

          COEFF(1,3,4)= COUP*-F1(6)
                              1
    Warning: Extension: Unary operator following arithmetic operator (use parentheses) at (1)
    FFV1L3_2.f:110.26:

          COEFF(2,3,4)= COUP*-F1(5)
                              1
    Warning: Extension: Unary operator following arithmetic operator (use parentheses) at (1)
    FFV1L3_2.f:111.26:

          COEFF(3,3,4)= COUP*-F1(8)
                              1
    Warning: Extension: Unary operator following arithmetic operator (use parentheses) at (1)
    FFV1L3_2.f:112.26:

          COEFF(4,3,4)= COUP*-F1(7)
                              1
    Warning: Extension: Unary operator following arithmetic operator (use parentheses) at (1)
    gfortran -O -fno-automatic -ffixed-line-length-132 -c -o MP_FFV1L3_2.o MP_FFV1L3_2.f
    MP_FFV1L3_2.f:29.26:

          COEFF(1,1,1)= COUP*-CI * F1(5)
                              1
    Warning: Extension: Unary operator following arithmetic operator (use parentheses) at (1)
    MP_FFV1L3_2.f:30.26:

          COEFF(2,1,1)= COUP*-CI * F1(6)
                              1
    Warning: Extension: Unary operator following arithmetic operator (use parentheses) at (1)
    MP_FFV1L3_2.f:31.26:

          COEFF(3,1,1)= COUP*-CI * F1(7)
                              1
    Warning: Extension: Unary operator following arithmetic operator (use parentheses) at (1)
    MP_FFV1L3_2.f:32.26:

          COEFF(4,1,1)= COUP*-CI * F1(8)
                              1
    Warning: Extension: Unary operator following arithmetic operator (use parentheses) at (1)
    MP_FFV1L3_2.f:35.26:

          COEFF(3,2,1)= COUP*-CI * F1(8)
                              1
    Warning: Extension: Unary operator following arithmetic operator (use parentheses) at (1)
    MP_FFV1L3_2.f:36.26:

          COEFF(4,2,1)= COUP*-CI * F1(7)
                              1
    Warning: Extension: Unary operator following arithmetic operator (use parentheses) at (1)
    MP_FFV1L3_2.f:38.26:

          COEFF(2,3,1)= COUP*-F1(5)
                              1
    Warning: Extension: Unary operator following arithmetic operator (use parentheses) at (1)
    MP_FFV1L3_2.f:39.26:

          COEFF(3,3,1)= COUP*-F1(8)
                              1
    Warning: Extension: Unary operator following arithmetic operator (use parentheses) at (1)
    MP_FFV1L3_2.f:42.26:

          COEFF(2,4,1)= COUP*-CI * F1(6)
                              1
    Warning: Extension: Unary operator following arithmetic operator (use parentheses) at (1)
    MP_FFV1L3_2.f:43.26:

          COEFF(3,4,1)= COUP*-CI * F1(7)
                              1
    Warning: Extension: Unary operator following arithmetic operator (use parentheses) at (1)
    MP_FFV1L3_2.f:53.26:

          COEFF(1,1,2)= COUP*-CI * F1(6)
                              1
    Warning: Extension: Unary operator following arithmetic operator (use parentheses) at (1)
    MP_FFV1L3_2.f:54.26:

          COEFF(2,1,2)= COUP*-CI * F1(5)
                              1
    Warning: Extension: Unary operator following arithmetic operator (use parentheses) at (1)
    MP_FFV1L3_2.f:62.26:

          COEFF(2,3,2)= COUP*-F1(6)
                              1
    Warning: Extension: Unary operator following arithmetic operator (use parentheses) at (1)
    MP_FFV1L3_2.f:64.26:

          COEFF(4,3,2)= COUP*-F1(8)
                              1
    Warning: Extension: Unary operator following arithmetic operator (use parentheses) at (1)
    MP_FFV1L3_2.f:66.26:

          COEFF(2,4,2)= COUP*-CI * F1(5)
                              1
    Warning: Extension: Unary operator following arithmetic operator (use parentheses) at (1)
    MP_FFV1L3_2.f:68.26:

          COEFF(4,4,2)= COUP*-CI * F1(7)
                              1
    Warning: Extension: Unary operator following arithmetic operator (use parentheses) at (1)
    MP_FFV1L3_2.f:77.26:

          COEFF(1,1,3)= COUP*-F1(6)
                              1
    Warning: Extension: Unary operator following arithmetic operator (use parentheses) at (1)
    MP_FFV1L3_2.f:80.26:

          COEFF(4,1,3)= COUP*-F1(7)
                              1
    Warning: Extension: Unary operator following arithmetic operator (use parentheses) at (1)
    MP_FFV1L3_2.f:81.26:

          COEFF(1,2,3)= COUP*-F1(5)
                              1
    Warning: Extension: Unary operator following arithmetic operator (use parentheses) at (1)
    MP_FFV1L3_2.f:83.26:

          COEFF(3,2,3)= COUP*-F1(7)
                              1
    Warning: Extension: Unary operator following arithmetic operator (use parentheses) at (1)
    MP_FFV1L3_2.f:101.26:

          COEFF(1,1,4)= COUP*-CI * F1(5)
                              1
    Warning: Extension: Unary operator following arithmetic operator (use parentheses) at (1)
    MP_FFV1L3_2.f:104.26:

          COEFF(4,1,4)= COUP*-CI * F1(8)
                              1
    Warning: Extension: Unary operator following arithmetic operator (use parentheses) at (1)
    MP_FFV1L3_2.f:105.26:

          COEFF(1,2,4)= COUP*-CI * F1(6)
                              1
    Warning: Extension: Unary operator following arithmetic operator (use parentheses) at (1)
    MP_FFV1L3_2.f:107.26:

          COEFF(3,2,4)= COUP*-CI * F1(8)
                              1
    Warning: Extension: Unary operator following arithmetic operator (use parentheses) at (1)
    MP_FFV1L3_2.f:109.26:

          COEFF(1,3,4)= COUP*-F1(6)
                              1
    Warning: Extension: Unary operator following arithmetic operator (use parentheses) at (1)
    MP_FFV1L3_2.f:110.26:

          COEFF(2,3,4)= COUP*-F1(5)
                              1
    Warning: Extension: Unary operator following arithmetic operator (use parentheses) at (1)
    MP_FFV1L3_2.f:111.26:

          COEFF(3,3,4)= COUP*-F1(8)
                              1
    Warning: Extension: Unary operator following arithmetic operator (use parentheses) at (1)
    MP_FFV1L3_2.f:112.26:

          COEFF(4,3,4)= COUP*-F1(7)
                              1
    Warning: Extension: Unary operator following arithmetic operator (use parentheses) at (1)
    gfortran -O -fno-automatic -ffixed-line-length-132 -c -o FFV4_1.o FFV4_1.f
    gfortran -O -fno-automatic -ffixed-line-length-132 -c -o MP_FFV4_1.o MP_FFV4_1.f
    gfortran -O -fno-automatic -ffixed-line-length-132 -c -o FFV1_1.o FFV1_1.f
    gfortran -O -fno-automatic -ffixed-line-length-132 -c -o MP_FFV1_1.o MP_FFV1_1.f
    gfortran -O -fno-automatic -ffixed-line-length-132 -c -o FFV1_3_4L2_1.o FFV1_3_4L2_1.f
    gfortran -O -fno-automatic -ffixed-line-length-132 -c -o MP_FFV1_3_4L2_1.o MP_FFV1_3_4L2_1.f
    gfortran -O -fno-automatic -ffixed-line-length-132 -c -o FFV1_3_4_0.o FFV1_3_4_0.f
    gfortran -O -fno-automatic -ffixed-line-length-132 -c -o MP_FFV1_3_4_0.o MP_FFV1_3_4_0.f
    gfortran -O -fno-automatic -ffixed-line-length-132 -c -o FFV4L2_1.o FFV4L2_1.f
    FFV4L2_1.f:28.26:

          COEFF(4,0,1)= COUP*-M1*(V3(7)+CI*(V3(6)))
                              1
    Warning: Extension: Unary operator following arithmetic operator (use parentheses) at (1)
    FFV4L2_1.f:50.26:

          COEFF(3,0,2)= COUP*-M1*(+CI*(V3(6))-V3(7))
                              1
    Warning: Extension: Unary operator following arithmetic operator (use parentheses) at (1)
    gfortran -O -fno-automatic -ffixed-line-length-132 -c -o MP_FFV4L2_1.o MP_FFV4L2_1.f
    MP_FFV4L2_1.f:28.26:

          COEFF(4,0,1)= COUP*-M1*(V3(7)+CI*(V3(6)))
                              1
    Warning: Extension: Unary operator following arithmetic operator (use parentheses) at (1)
    MP_FFV4L2_1.f:50.26:

          COEFF(3,0,2)= COUP*-M1*(+CI*(V3(6))-V3(7))
                              1
    Warning: Extension: Unary operator following arithmetic operator (use parentheses) at (1)
    gfortran -O -fno-automatic -ffixed-line-length-132 -c -o FFV1_0.o FFV1_0.f
    gfortran -O -fno-automatic -ffixed-line-length-132 -c -o MP_FFV1_0.o MP_FFV1_0.f
    gfortran -O -fno-automatic -ffixed-line-length-132 -c -o FFV1_3_4L3_2.o FFV1_3_4L3_2.f
    gfortran -O -fno-automatic -ffixed-line-length-132 -c -o MP_FFV1_3_4L3_2.o MP_FFV1_3_4L3_2.f
    gfortran -O -fno-automatic -ffixed-line-length-132 -c -o FFV1L2_1.o FFV1L2_1.f
    FFV1L2_1.f:28.26:

          COEFF(4,0,1)= COUP*-M1*(V3(7)+CI*(V3(6)))
                              1
    Warning: Extension: Unary operator following arithmetic operator (use parentheses) at (1)
    FFV1L2_1.f:50.26:

          COEFF(3,0,2)= COUP*-M1*(+CI*(V3(6))-V3(7))
                              1
    Warning: Extension: Unary operator following arithmetic operator (use parentheses) at (1)
    gfortran -O -fno-automatic -ffixed-line-length-132 -c -o MP_FFV1L2_1.o MP_FFV1L2_1.f
    MP_FFV1L2_1.f:28.26:

          COEFF(4,0,1)= COUP*-M1*(V3(7)+CI*(V3(6)))
                              1
    Warning: Extension: Unary operator following arithmetic operator (use parentheses) at (1)
    MP_FFV1L2_1.f:50.26:

          COEFF(3,0,2)= COUP*-M1*(+CI*(V3(6))-V3(7))
                              1
    Warning: Extension: Unary operator following arithmetic operator (use parentheses) at (1)
    gfortran -O -fno-automatic -ffixed-line-length-132 -c -o FFV4_2.o FFV4_2.f
    gfortran -O -fno-automatic -ffixed-line-length-132 -c -o MP_FFV4_2.o MP_FFV4_2.f
    gfortran -O -fno-automatic -ffixed-line-length-132 -c -o FFV4L1_2.o FFV4L1_2.f
    FFV4L1_2.f:62.26:

          COEFF(2,0,3)= COUP*-M2*(+CI*(V3(6))-V3(7))
                              1
    Warning: Extension: Unary operator following arithmetic operator (use parentheses) at (1)
    FFV4L1_2.f:84.26:

          COEFF(1,0,4)= COUP*-M2*(V3(7)+CI*(V3(6)))
                              1
    Warning: Extension: Unary operator following arithmetic operator (use parentheses) at (1)
    gfortran -O -fno-automatic -ffixed-line-length-132 -c -o MP_FFV4L1_2.o MP_FFV4L1_2.f
    MP_FFV4L1_2.f:62.26:

          COEFF(2,0,3)= COUP*-M2*(+CI*(V3(6))-V3(7))
                              1
    Warning: Extension: Unary operator following arithmetic operator (use parentheses) at (1)
    MP_FFV4L1_2.f:84.26:

          COEFF(1,0,4)= COUP*-M2*(V3(7)+CI*(V3(6)))
                              1
    Warning: Extension: Unary operator following arithmetic operator (use parentheses) at (1)
    gfortran -O -fno-automatic -ffixed-line-length-132 -c -o FF4_0.o FF4_0.f
    gfortran -O -fno-automatic -ffixed-line-length-132 -c -o MP_FF4_0.o MP_FF4_0.f
    gfortran -O -fno-automatic -ffixed-line-length-132 -c -o FFV1_3_4_1.o FFV1_3_4_1.f
    gfortran -O -fno-automatic -ffixed-line-length-132 -c -o MP_FFV1_3_4_1.o MP_FFV1_3_4_1.f
    gfortran -O -fno-automatic -ffixed-line-length-132 -c -o FFV1L1_2.o FFV1L1_2.f
    FFV1L1_2.f:69.26:

          COEFF(2,0,3)= COUP*-M2*(+CI*(V3(6))-V3(7))
                              1
    Warning: Extension: Unary operator following arithmetic operator (use parentheses) at (1)
    FFV1L1_2.f:91.26:

          COEFF(1,0,4)= COUP*-M2*(V3(7)+CI*(V3(6)))
                              1
    Warning: Extension: Unary operator following arithmetic operator (use parentheses) at (1)
    gfortran -O -fno-automatic -ffixed-line-length-132 -c -o MP_FFV1L1_2.o MP_FFV1L1_2.f
    MP_FFV1L1_2.f:69.26:

          COEFF(2,0,3)= COUP*-M2*(+CI*(V3(6))-V3(7))
                              1
    Warning: Extension: Unary operator following arithmetic operator (use parentheses) at (1)
    MP_FFV1L1_2.f:91.26:

          COEFF(1,0,4)= COUP*-M2*(V3(7)+CI*(V3(6)))
                              1
    Warning: Extension: Unary operator following arithmetic operator (use parentheses) at (1)
    gfortran -O -fno-automatic -ffixed-line-length-132 -c -o FFV1_3_4L1P0_3.o FFV1_3_4L1P0_3.f
    gfortran -O -fno-automatic -ffixed-line-length-132 -c -o MP_FFV1_3_4L1P0_3.o MP_FFV1_3_4L1P0_3.f
    gfortran -O -fno-automatic -ffixed-line-length-132 -c -o FFV4_3.o FFV4_3.f
    gfortran -O -fno-automatic -ffixed-line-length-132 -c -o MP_FFV4_3.o MP_FFV4_3.f
    gfortran -O -fno-automatic -ffixed-line-length-132 -c -o FFV1L3_1.o FFV1L3_1.f
    FFV1L3_1.f:35.26:

          COEFF(3,2,1)= COUP*-CI * F2(8)
                              1
    Warning: Extension: Unary operator following arithmetic operator (use parentheses) at (1)
    FFV1L3_1.f:36.26:

          COEFF(4,2,1)= COUP*-CI * F2(7)
                              1
    Warning: Extension: Unary operator following arithmetic operator (use parentheses) at (1)
    FFV1L3_1.f:37.26:

          COEFF(1,3,1)= COUP*-F2(6)
                              1
    Warning: Extension: Unary operator following arithmetic operator (use parentheses) at (1)
    FFV1L3_1.f:40.26:

          COEFF(4,3,1)= COUP*-F2(7)
                              1
    Warning: Extension: Unary operator following arithmetic operator (use parentheses) at (1)
    FFV1L3_1.f:42.26:

          COEFF(2,4,1)= COUP*-CI * F2(6)
                              1
    Warning: Extension: Unary operator following arithmetic operator (use parentheses) at (1)
    FFV1L3_1.f:43.26:

          COEFF(3,4,1)= COUP*-CI * F2(7)
                              1
    Warning: Extension: Unary operator following arithmetic operator (use parentheses) at (1)
    FFV1L3_1.f:53.26:

          COEFF(1,1,2)= COUP*-CI * F2(6)
                              1
    Warning: Extension: Unary operator following arithmetic operator (use parentheses) at (1)
    FFV1L3_1.f:54.26:

          COEFF(2,1,2)= COUP*-CI * F2(5)
                              1
    Warning: Extension: Unary operator following arithmetic operator (use parentheses) at (1)
    FFV1L3_1.f:57.26:

          COEFF(1,2,2)= COUP*-CI * F2(5)
                              1
    Warning: Extension: Unary operator following arithmetic operator (use parentheses) at (1)
    FFV1L3_1.f:58.26:

          COEFF(2,2,2)= COUP*-CI * F2(6)
                              1
    Warning: Extension: Unary operator following arithmetic operator (use parentheses) at (1)
    FFV1L3_1.f:59.26:

          COEFF(3,2,2)= COUP*-CI * F2(7)
                              1
    Warning: Extension: Unary operator following arithmetic operator (use parentheses) at (1)
    FFV1L3_1.f:60.26:

          COEFF(4,2,2)= COUP*-CI * F2(8)
                              1
    Warning: Extension: Unary operator following arithmetic operator (use parentheses) at (1)
    FFV1L3_1.f:62.26:

          COEFF(2,3,2)= COUP*-F2(6)
                              1
    Warning: Extension: Unary operator following arithmetic operator (use parentheses) at (1)
    FFV1L3_1.f:64.26:

          COEFF(4,3,2)= COUP*-F2(8)
                              1
    Warning: Extension: Unary operator following arithmetic operator (use parentheses) at (1)
    FFV1L3_1.f:65.26:

          COEFF(1,4,2)= COUP*-CI * F2(6)
                              1
    Warning: Extension: Unary operator following arithmetic operator (use parentheses) at (1)
    FFV1L3_1.f:67.26:

          COEFF(3,4,2)= COUP*-CI * F2(8)
                              1
    Warning: Extension: Unary operator following arithmetic operator (use parentheses) at (1)
    FFV1L3_1.f:78.26:

          COEFF(2,1,3)= COUP*-F2(5)
                              1
    Warning: Extension: Unary operator following arithmetic operator (use parentheses) at (1)
    FFV1L3_1.f:79.26:

          COEFF(3,1,3)= COUP*-F2(8)
                              1
    Warning: Extension: Unary operator following arithmetic operator (use parentheses) at (1)
    FFV1L3_1.f:81.26:

          COEFF(1,2,3)= COUP*-F2(5)
                              1
    Warning: Extension: Unary operator following arithmetic operator (use parentheses) at (1)
    FFV1L3_1.f:83.26:

          COEFF(3,2,3)= COUP*-F2(7)
                              1
    Warning: Extension: Unary operator following arithmetic operator (use parentheses) at (1)
    FFV1L3_1.f:85.26:

          COEFF(1,3,3)= COUP*-CI * F2(5)
                              1
    Warning: Extension: Unary operator following arithmetic operator (use parentheses) at (1)
    FFV1L3_1.f:86.26:

          COEFF(2,3,3)= COUP*-CI * F2(6)
                              1
    Warning: Extension: Unary operator following arithmetic operator (use parentheses) at (1)
    FFV1L3_1.f:87.26:

          COEFF(3,3,3)= COUP*-CI * F2(7)
                              1
    Warning: Extension: Unary operator following arithmetic operator (use parentheses) at (1)
    FFV1L3_1.f:88.26:

          COEFF(4,3,3)= COUP*-CI * F2(8)
                              1
    Warning: Extension: Unary operator following arithmetic operator (use parentheses) at (1)
    FFV1L3_1.f:101.26:

          COEFF(1,1,4)= COUP*-CI * F2(5)
                              1
    Warning: Extension: Unary operator following arithmetic operator (use parentheses) at (1)
    FFV1L3_1.f:104.26:

          COEFF(4,1,4)= COUP*-CI * F2(8)
                              1
    Warning: Extension: Unary operator following arithmetic operator (use parentheses) at (1)
    FFV1L3_1.f:106.26:

          COEFF(2,2,4)= COUP*-CI * F2(5)
                              1
    Warning: Extension: Unary operator following arithmetic operator (use parentheses) at (1)
    FFV1L3_1.f:108.26:

          COEFF(4,2,4)= COUP*-CI * F2(7)
                              1
    Warning: Extension: Unary operator following arithmetic operator (use parentheses) at (1)
    FFV1L3_1.f:109.26:

          COEFF(1,3,4)= COUP*-F2(6)
                              1
    Warning: Extension: Unary operator following arithmetic operator (use parentheses) at (1)
    FFV1L3_1.f:110.26:

          COEFF(2,3,4)= COUP*-F2(5)
                              1
    Warning: Extension: Unary operator following arithmetic operator (use parentheses) at (1)
    FFV1L3_1.f:111.26:

          COEFF(3,3,4)= COUP*-F2(8)
                              1
    Warning: Extension: Unary operator following arithmetic operator (use parentheses) at (1)
    FFV1L3_1.f:112.26:

          COEFF(4,3,4)= COUP*-F2(7)
                              1
    Warning: Extension: Unary operator following arithmetic operator (use parentheses) at (1)
    FFV1L3_1.f:113.26:

          COEFF(1,4,4)= COUP*-CI * F2(5)
                              1
    Warning: Extension: Unary operator following arithmetic operator (use parentheses) at (1)
    FFV1L3_1.f:114.26:

          COEFF(2,4,4)= COUP*-CI * F2(6)
                              1
    Warning: Extension: Unary operator following arithmetic operator (use parentheses) at (1)
    FFV1L3_1.f:115.26:

          COEFF(3,4,4)= COUP*-CI * F2(7)
                              1
    Warning: Extension: Unary operator following arithmetic operator (use parentheses) at (1)
    FFV1L3_1.f:116.26:

          COEFF(4,4,4)= COUP*-CI * F2(8)
                              1
    Warning: Extension: Unary operator following arithmetic operator (use parentheses) at (1)
    gfortran -O -fno-automatic -ffixed-line-length-132 -c -o MP_FFV1L3_1.o MP_FFV1L3_1.f
    MP_FFV1L3_1.f:35.26:

          COEFF(3,2,1)= COUP*-CI * F2(8)
                              1
    Warning: Extension: Unary operator following arithmetic operator (use parentheses) at (1)
    MP_FFV1L3_1.f:36.26:

          COEFF(4,2,1)= COUP*-CI * F2(7)
                              1
    Warning: Extension: Unary operator following arithmetic operator (use parentheses) at (1)
    MP_FFV1L3_1.f:37.26:

          COEFF(1,3,1)= COUP*-F2(6)
                              1
    Warning: Extension: Unary operator following arithmetic operator (use parentheses) at (1)
    MP_FFV1L3_1.f:40.26:

          COEFF(4,3,1)= COUP*-F2(7)
                              1
    Warning: Extension: Unary operator following arithmetic operator (use parentheses) at (1)
    MP_FFV1L3_1.f:42.26:

          COEFF(2,4,1)= COUP*-CI * F2(6)
                              1
    Warning: Extension: Unary operator following arithmetic operator (use parentheses) at (1)
    MP_FFV1L3_1.f:43.26:

          COEFF(3,4,1)= COUP*-CI * F2(7)
                              1
    Warning: Extension: Unary operator following arithmetic operator (use parentheses) at (1)
    MP_FFV1L3_1.f:53.26:

          COEFF(1,1,2)= COUP*-CI * F2(6)
                              1
    Warning: Extension: Unary operator following arithmetic operator (use parentheses) at (1)
    MP_FFV1L3_1.f:54.26:

          COEFF(2,1,2)= COUP*-CI * F2(5)
                              1
    Warning: Extension: Unary operator following arithmetic operator (use parentheses) at (1)
    MP_FFV1L3_1.f:57.26:

          COEFF(1,2,2)= COUP*-CI * F2(5)
                              1
    Warning: Extension: Unary operator following arithmetic operator (use parentheses) at (1)
    MP_FFV1L3_1.f:58.26:

          COEFF(2,2,2)= COUP*-CI * F2(6)
                              1
    Warning: Extension: Unary operator following arithmetic operator (use parentheses) at (1)
    MP_FFV1L3_1.f:59.26:

          COEFF(3,2,2)= COUP*-CI * F2(7)
                              1
    Warning: Extension: Unary operator following arithmetic operator (use parentheses) at (1)
    MP_FFV1L3_1.f:60.26:

          COEFF(4,2,2)= COUP*-CI * F2(8)
                              1
    Warning: Extension: Unary operator following arithmetic operator (use parentheses) at (1)
    MP_FFV1L3_1.f:62.26:

          COEFF(2,3,2)= COUP*-F2(6)
                              1
    Warning: Extension: Unary operator following arithmetic operator (use parentheses) at (1)
    MP_FFV1L3_1.f:64.26:

          COEFF(4,3,2)= COUP*-F2(8)
                              1
    Warning: Extension: Unary operator following arithmetic operator (use parentheses) at (1)
    MP_FFV1L3_1.f:65.26:

          COEFF(1,4,2)= COUP*-CI * F2(6)
                              1
    Warning: Extension: Unary operator following arithmetic operator (use parentheses) at (1)
    MP_FFV1L3_1.f:67.26:

          COEFF(3,4,2)= COUP*-CI * F2(8)
                              1
    Warning: Extension: Unary operator following arithmetic operator (use parentheses) at (1)
    MP_FFV1L3_1.f:78.26:

          COEFF(2,1,3)= COUP*-F2(5)
                              1
    Warning: Extension: Unary operator following arithmetic operator (use parentheses) at (1)
    MP_FFV1L3_1.f:79.26:

          COEFF(3,1,3)= COUP*-F2(8)
                              1
    Warning: Extension: Unary operator following arithmetic operator (use parentheses) at (1)
    MP_FFV1L3_1.f:81.26:

          COEFF(1,2,3)= COUP*-F2(5)
                              1
    Warning: Extension: Unary operator following arithmetic operator (use parentheses) at (1)
    MP_FFV1L3_1.f:83.26:

          COEFF(3,2,3)= COUP*-F2(7)
                              1
    Warning: Extension: Unary operator following arithmetic operator (use parentheses) at (1)
    MP_FFV1L3_1.f:85.26:

          COEFF(1,3,3)= COUP*-CI * F2(5)
                              1
    Warning: Extension: Unary operator following arithmetic operator (use parentheses) at (1)
    MP_FFV1L3_1.f:86.26:

          COEFF(2,3,3)= COUP*-CI * F2(6)
                              1
    Warning: Extension: Unary operator following arithmetic operator (use parentheses) at (1)
    MP_FFV1L3_1.f:87.26:

          COEFF(3,3,3)= COUP*-CI * F2(7)
                              1
    Warning: Extension: Unary operator following arithmetic operator (use parentheses) at (1)
    MP_FFV1L3_1.f:88.26:

          COEFF(4,3,3)= COUP*-CI * F2(8)
                              1
    Warning: Extension: Unary operator following arithmetic operator (use parentheses) at (1)
    MP_FFV1L3_1.f:101.26:

          COEFF(1,1,4)= COUP*-CI * F2(5)
                              1
    Warning: Extension: Unary operator following arithmetic operator (use parentheses) at (1)
    MP_FFV1L3_1.f:104.26:

          COEFF(4,1,4)= COUP*-CI * F2(8)
                              1
    Warning: Extension: Unary operator following arithmetic operator (use parentheses) at (1)
    MP_FFV1L3_1.f:106.26:

          COEFF(2,2,4)= COUP*-CI * F2(5)
                              1
    Warning: Extension: Unary operator following arithmetic operator (use parentheses) at (1)
    MP_FFV1L3_1.f:108.26:

          COEFF(4,2,4)= COUP*-CI * F2(7)
                              1
    Warning: Extension: Unary operator following arithmetic operator (use parentheses) at (1)
    MP_FFV1L3_1.f:109.26:

          COEFF(1,3,4)= COUP*-F2(6)
                              1
    Warning: Extension: Unary operator following arithmetic operator (use parentheses) at (1)
    MP_FFV1L3_1.f:110.26:

          COEFF(2,3,4)= COUP*-F2(5)
                              1
    Warning: Extension: Unary operator following arithmetic operator (use parentheses) at (1)
    MP_FFV1L3_1.f:111.26:

          COEFF(3,3,4)= COUP*-F2(8)
                              1
    Warning: Extension: Unary operator following arithmetic operator (use parentheses) at (1)
    MP_FFV1L3_1.f:112.26:

          COEFF(4,3,4)= COUP*-F2(7)
                              1
    Warning: Extension: Unary operator following arithmetic operator (use parentheses) at (1)
    MP_FFV1L3_1.f:113.26:

          COEFF(1,4,4)= COUP*-CI * F2(5)
                              1
    Warning: Extension: Unary operator following arithmetic operator (use parentheses) at (1)
    MP_FFV1L3_1.f:114.26:

          COEFF(2,4,4)= COUP*-CI * F2(6)
                              1
    Warning: Extension: Unary operator following arithmetic operator (use parentheses) at (1)
    MP_FFV1L3_1.f:115.26:

          COEFF(3,4,4)= COUP*-CI * F2(7)
                              1
    Warning: Extension: Unary operator following arithmetic operator (use parentheses) at (1)
    MP_FFV1L3_1.f:116.26:

          COEFF(4,4,4)= COUP*-CI * F2(8)
                              1
    Warning: Extension: Unary operator following arithmetic operator (use parentheses) at (1)
    gfortran -O -fno-automatic -ffixed-line-length-132 -c -o FFV1_3_4L3_1.o FFV1_3_4L3_1.f
    gfortran -O -fno-automatic -ffixed-line-length-132 -c -o MP_FFV1_3_4L3_1.o MP_FFV1_3_4L3_1.f
    ar cru ../../lib/libdhelas.a aloha_functions.o FFV1_3_4_2.o MP_FFV1_3_4_2.o FFV4_0.o MP_FFV4_0.o FFV1_2.o MP_FFV1_2.o FFV1_3_4L2P0_3.o MP_FFV1_3_4L2P0_3.o FFV1L2P0_3.o MP_FFV1L2P0_3.o FF1_0.o MP_FF1_0.o FFV1_3_4L1_2.o MP_FFV1_3_4L1_2.o FFV1L1P0_3.o MP_FFV1L1P0_3.o FFV3_0.o MP_FFV3_0.o FFV1L3_2.o MP_FFV1L3_2.o FFV4_1.o MP_FFV4_1.o FFV1_1.o MP_FFV1_1.o FFV1_3_4L2_1.o MP_FFV1_3_4L2_1.o FFV1_3_4_0.o MP_FFV1_3_4_0.o FFV4L2_1.o MP_FFV4L2_1.o FFV1_0.o MP_FFV1_0.o FFV1_3_4L3_2.o MP_FFV1_3_4L3_2.o FFV1L2_1.o MP_FFV1L2_1.o FFV4_2.o MP_FFV4_2.o FFV4L1_2.o MP_FFV4L1_2.o FF4_0.o MP_FF4_0.o FFV1_3_4_1.o MP_FFV1_3_4_1.o FFV1L1_2.o MP_FFV1L1_2.o FFV1_3_4L1P0_3.o MP_FFV1_3_4L1P0_3.o FFV4_3.o MP_FFV4_3.o FFV1L3_1.o MP_FFV1L3_1.o FFV1_3_4L3_1.o MP_FFV1_3_4L3_1.o
    ranlib ../../lib/libdhelas.a
    make[1]: Leaving directory `/data9/Users/shjeon/gridpack_MG5_aMC_v2_6_0_copy1/MG5_aMC_v2_6_0/WRToNLep_MuMuJJ_WR400_N100_Tchannel_NLO/Source/DHELAS'
    gfortran -O -fno-automatic -ffixed-line-length-132 -c alfas_functions_lhapdf.f
    gfortran -O -fno-automatic -ffixed-line-length-132 -c rw_routines.f
    gfortran -O -fno-automatic -ffixed-line-length-132 -c kin_functions.f
    run.inc:74.21:
        Included at kin_functions.f:111:

          common/to_rwgt/ do_rwgt_scale, rw_Fscale_down, rw_Fscale_up, rw_Rscale_do
                         1
    Warning: Padding of 4 bytes required before 'rw_fscale_down' in COMMON 'to_rwgt' at (1); reorder elements or use -fno-align-commons
    run.inc:74.21:
        Included at kin_functions.f:136:

          common/to_rwgt/ do_rwgt_scale, rw_Fscale_down, rw_Fscale_up, rw_Rscale_do
                         1
    Warning: Padding of 4 bytes required before 'rw_fscale_down' in COMMON 'to_rwgt' at (1); reorder elements or use -fno-align-commons
    run.inc:74.21:
        Included at kin_functions.f:232:

          common/to_rwgt/ do_rwgt_scale, rw_Fscale_down, rw_Fscale_up, rw_Rscale_do
                         1
    Warning: Padding of 4 bytes required before 'rw_fscale_down' in COMMON 'to_rwgt' at (1); reorder elements or use -fno-align-commons
    run.inc:74.21:
        Included at kin_functions.f:327:

          common/to_rwgt/ do_rwgt_scale, rw_Fscale_down, rw_Fscale_up, rw_Rscale_do
                         1
    Warning: Padding of 4 bytes required before 'rw_fscale_down' in COMMON 'to_rwgt' at (1); reorder elements or use -fno-align-commons
    run.inc:74.21:
        Included at kin_functions.f:376:

          common/to_rwgt/ do_rwgt_scale, rw_Fscale_down, rw_Fscale_up, rw_Rscale_do
                         1
    Warning: Padding of 4 bytes required before 'rw_fscale_down' in COMMON 'to_rwgt' at (1); reorder elements or use -fno-align-commons
    gfortran -O -fno-automatic -ffixed-line-length-132 -c run_printout.f
    run.inc:74.21:
        Included at run_printout.f:15:

          common/to_rwgt/ do_rwgt_scale, rw_Fscale_down, rw_Fscale_up, rw_Rscale_do
                         1
    Warning: Padding of 4 bytes required before 'rw_fscale_down' in COMMON 'to_rwgt' at (1); reorder elements or use -fno-align-commons
    gfortran -O -fno-automatic -ffixed-line-length-132 -c dgauss.f
    gfortran -O -fno-automatic -ffixed-line-length-132 -c ranmar.f
    gfortran -O -fno-automatic -ffixed-line-length-132 -c extra_weights.f
    gfortran -O -fno-automatic -ffixed-line-length-132 -c -o setrun.o setrun.f
    run.inc:74.21:
        Included at setrun.f:12:

          common/to_rwgt/ do_rwgt_scale, rw_Fscale_down, rw_Fscale_up, rw_Rscale_do
                         1
    Warning: Padding of 4 bytes required before 'rw_fscale_down' in COMMON 'to_rwgt' at (1); reorder elements or use -fno-align-commons
    rm -f ../lib/libgeneric.a
    ar cru libgeneric.a alfas_functions_lhapdf.o rw_routines.o kin_functions.o run_printout.o dgauss.o ranmar.o setrun.o extra_weights.o
    ranlib libgeneric.a
    mv libgeneric.a ../lib/
    cp -f extra_weights.mod ../lib/
    rm -f alfas_functions_lhapdf.o
    rm -f ../lib/libpdf.a
    cd PDF; make
    make[1]: Entering directory `/data9/Users/shjeon/gridpack_MG5_aMC_v2_6_0_copy1/MG5_aMC_v2_6_0/WRToNLep_MuMuJJ_WR400_N100_Tchannel_NLO/Source/PDF'
    gfortran -O -fno-automatic -ffixed-line-length-132 -c -o pdfwrap_lhapdf.o pdfwrap_lhapdf.f
    g++ -O -O3 -I/cvmfs/cms.cern.ch/slc6_amd64_gcc481/external/lhapdf/6.2.1-ddibom/include -c -o pdf_lhapdf6.o pdf_lhapdf6.cc
    pdf_lhapdf6.cc:44:11: error: 'boost' does not name a type
       typedef boost::shared_ptr<LHAPDF::PDF> PDFPtr;
               ^
    pdf_lhapdf6.cc:102:11: error: 'PDFPtr' does not name a type
         const PDFPtr member(int mem) {
               ^
    pdf_lhapdf6.cc:111:11: error: 'PDFPtr' does not name a type
         const PDFPtr activemember() {
               ^
    pdf_lhapdf6.cc:126:14: error: 'PDFPtr' was not declared in this scope
         map<int, PDFPtr> members;
                  ^
    pdf_lhapdf6.cc:126:20: error: template argument 2 is invalid
         map<int, PDFPtr> members;
                        ^
    pdf_lhapdf6.cc:126:20: error: template argument 4 is invalid
    pdf_lhapdf6.cc: In member function 'void lhapdf_amc::PDFSetHandler::loadMember(int)':
    pdf_lhapdf6.cc:86:19: error: request for member 'find' in '((lhapdf_amc::PDFSetHandler*)this)->lhapdf_amc::PDFSetHandler::members', which is of non-class type 'int'
           if (members.find(mem) == members.end())
                       ^
    pdf_lhapdf6.cc:86:40: error: request for member 'end' in '((lhapdf_amc::PDFSetHandler*)this)->lhapdf_amc::PDFSetHandler::members', which is of non-class type 'int'
           if (members.find(mem) == members.end())
                                            ^
    pdf_lhapdf6.cc:87:20: error: invalid types 'int[int]' for array subscript
             members[mem] = PDFPtr(LHAPDF::mkPDF(setname, mem));
                        ^
    pdf_lhapdf6.cc:87:58: error: 'PDFPtr' was not declared in this scope
             members[mem] = PDFPtr(LHAPDF::mkPDF(setname, mem));
                                                              ^
    pdf_lhapdf6.cc: In member function 'void lhapdf_amc::PDFSetHandler::unloadMember(int)':
    pdf_lhapdf6.cc:93:15: error: request for member 'erase' in '((lhapdf_amc::PDFSetHandler*)this)->lhapdf_amc::PDFSetHandler::members', which is of non-class type 'int'
           members.erase(mem);
                   ^
    pdf_lhapdf6.cc:94:37: error: request for member 'empty' in '((lhapdf_amc::PDFSetHandler*)this)->lhapdf_amc::PDFSetHandler::members', which is of non-class type 'int'
           const int nextmem = (!members.empty()) ? members.begin()->first : 0;
                                         ^
    pdf_lhapdf6.cc:94:56: error: request for member 'begin' in '((lhapdf_amc::PDFSetHandler*)this)->lhapdf_amc::PDFSetHandler::members', which is of non-class type 'int'
           const int nextmem = (!members.empty()) ? members.begin()->first : 0;
                                                            ^
    pdf_lhapdf6.cc: In function 'std::string lhaglue_get_current_pdf(int)':
    pdf_lhapdf6.cc:144:39: error: 'std::map<int, lhapdf_amc::PDFSetHandler>::mapped_type' has no member named 'activemember'
       return lhapdf_amc::ACTIVESETS[nset].activemember()->set().name() + " (" +
                                           ^
    pdf_lhapdf6.cc:145:49: error: 'std::map<int, lhapdf_amc::PDFSetHandler>::mapped_type' has no member named 'activemember'
         LHAPDF::to_str(lhapdf_amc::ACTIVESETS[nset].activemember()->lhapdfID()) + ")";
                                                     ^
    pdf_lhapdf6.cc: In function 'void lhapdf_getversion_(char*, size_t)':
    pdf_lhapdf6.cc:156:35: error: 'strncpy' was not declared in this scope
         strncpy(s, LHAPDF_VERSION, len);
                                       ^
    pdf_lhapdf6.cc: In function 'void lhapdf_getpdfsetlist_(char*, size_t)':
    pdf_lhapdf6.cc:162:19: error: expected primary-expression before 'const'
         BOOST_FOREACH(const string& setname, LHAPDF::availablePDFSets()) {
                       ^
    pdf_lhapdf6.cc:162:68: error: 'BOOST_FOREACH' was not declared in this scope
         BOOST_FOREACH(const string& setname, LHAPDF::availablePDFSets()) {
                                                                        ^
    pdf_lhapdf6.cc:162:70: error: expected ';' before '{' token
         BOOST_FOREACH(const string& setname, LHAPDF::availablePDFSets()) {
                                                                          ^
    pdf_lhapdf6.cc:166:36: error: 'strncpy' was not declared in this scope
         strncpy(s, liststr.c_str(), len);
                                        ^
    pdf_lhapdf6.cc: In function 'void getlhapdfversion_(char*, size_t)':
    pdf_lhapdf6.cc:180:35: error: 'strncpy' was not declared in this scope
         strncpy(s, LHAPDF_VERSION, len);
                                       ^
    pdf_lhapdf6.cc: In function 'void setpdfpath_(const char*, size_t)':
    pdf_lhapdf6.cc:205:23: error: 'strncpy' was not declared in this scope
         strncpy(s2, s, len);
                           ^
    pdf_lhapdf6.cc: In function 'void getdatapath_(char*, size_t)':
    pdf_lhapdf6.cc:213:19: error: expected primary-expression before 'const'
         BOOST_FOREACH(const string& path, LHAPDF::paths()) {
                       ^
    pdf_lhapdf6.cc:213:54: error: 'BOOST_FOREACH' was not declared in this scope
         BOOST_FOREACH(const string& path, LHAPDF::paths()) {
                                                          ^
    pdf_lhapdf6.cc:213:56: error: expected ';' before '{' token
         BOOST_FOREACH(const string& path, LHAPDF::paths()) {
                                                            ^
    pdf_lhapdf6.cc:217:36: error: 'strncpy' was not declared in this scope
         strncpy(s, pathstr.c_str(), len);
                                        ^
    pdf_lhapdf6.cc: In function 'void initpdfsetm_(const int&, const char*, int)':
    pdf_lhapdf6.cc:239:9: error: 'boost' has not been declared
         if (boost::algorithm::to_lower_copy(path) == "cteq6ll") path = "cteq6l1";
             ^
    pdf_lhapdf6.cc: In function 'void initpdfsetbynamem_(const int&, const char*, int)':
    pdf_lhapdf6.cc:262:9: error: 'boost' has not been declared
         if (boost::algorithm::to_lower_copy(name) == "cteq6ll") name = "cteq6l1";
             ^
    pdf_lhapdf6.cc: In function 'void evolvepdfm_(const int&, const double&, const double&, double*)':
    pdf_lhapdf6.cc:336:47: error: 'std::map<int, lhapdf_amc::PDFSetHandler>::mapped_type' has no member named 'activemember'
             fxq[i] = lhapdf_amc::ACTIVESETS[nset].activemember()->xfxQ(i-6, x, q);
                                                   ^
    pdf_lhapdf6.cc: In function 'void evolvepartm_(const int&, const int&, const double&, const double&, double&)':
    pdf_lhapdf6.cc:361:42: error: 'std::map<int, lhapdf_amc::PDFSetHandler>::mapped_type' has no member named 'activemember'
           fxq = lhapdf_amc::ACTIVESETS[nset].activemember()->xfxQ(ipart_copy, x, q);
                                              ^
    pdf_lhapdf6.cc: In function 'bool has_photon_()':
    pdf_lhapdf6.cc:379:59: error: 'std::map<int, lhapdf_amc::PDFSetHandler>::mapped_type' has no member named 'activemember'
         return lhapdf_amc::ACTIVESETS[lhapdf_amc::CURRENTSET].activemember()->hasFlavor(22);
                                                               ^
    pdf_lhapdf6.cc: In function 'void evolvepdfphotonm_(const int&, const double&, const double&, double*, double&)':
    pdf_lhapdf6.cc:391:48: error: 'std::map<int, lhapdf_amc::PDFSetHandler>::mapped_type' has no member named 'activemember'
           photonfxq = lhapdf_amc::ACTIVESETS[nset].activemember()->xfxQ(22, x, q);
                                                    ^
    pdf_lhapdf6.cc: In function 'void getorderasm_(const int&, int&)':
    pdf_lhapdf6.cc:425:40: error: 'std::map<int, lhapdf_amc::PDFSetHandler>::mapped_type' has no member named 'activemember'
         oas = lhapdf_amc::ACTIVESETS[nset].activemember()->info().get_entry_as<int>("AlphaS_OrderQCD");
                                            ^
    pdf_lhapdf6.cc:425:76: error: expected primary-expression before 'int'
         oas = lhapdf_amc::ACTIVESETS[nset].activemember()->info().get_entry_as<int>("AlphaS_OrderQCD");
                                                                                ^
    pdf_lhapdf6.cc:425:76: error: expected ';' before 'int'
    pdf_lhapdf6.cc: In function 'double alphaspdfm_(const int&, const double&)':
    pdf_lhapdf6.cc:440:41: error: 'std::map<int, lhapdf_amc::PDFSetHandler>::mapped_type' has no member named 'activemember'
         return lhapdf_amc::ACTIVESETS[nset].activemember()->alphasQ(Q);
                                             ^
    pdf_lhapdf6.cc: In function 'void numberpdfm_(const int&, int&)':
    pdf_lhapdf6.cc:458:43: error: 'std::map<int, lhapdf_amc::PDFSetHandler>::mapped_type' has no member named 'activemember'
         numpdf= lhapdf_amc::ACTIVESETS[nset].activemember()->info().get_entry_as<int>("NumMembers");
                                               ^
    pdf_lhapdf6.cc:458:79: error: expected primary-expression before 'int'
         numpdf= lhapdf_amc::ACTIVESETS[nset].activemember()->info().get_entry_as<int>("NumMembers");
                                                                                   ^
    pdf_lhapdf6.cc:458:79: error: expected ';' before 'int'
    pdf_lhapdf6.cc: In function 'void getnfm_(const int&, int&)':
    pdf_lhapdf6.cc:474:39: error: 'std::map<int, lhapdf_amc::PDFSetHandler>::mapped_type' has no member named 'activemember'
         nf = lhapdf_amc::ACTIVESETS[nset].activemember()->info().get_entry_as<int>("NumFlavors");
                                           ^
    pdf_lhapdf6.cc:474:75: error: expected primary-expression before 'int'
         nf = lhapdf_amc::ACTIVESETS[nset].activemember()->info().get_entry_as<int>("NumFlavors");
                                                                               ^
    pdf_lhapdf6.cc:474:75: error: expected ';' before 'int'
    pdf_lhapdf6.cc: In function 'void getqmassm_(const int&, const int&, double&)':
    pdf_lhapdf6.cc:489:63: error: 'std::map<int, lhapdf_amc::PDFSetHandler>::mapped_type' has no member named 'activemember'
         if (nf*nf == 1) mass = lhapdf_amc::ACTIVESETS[nset].activemember()->info().get_entry_as<double>("MDown");
                                                                   ^
    pdf_lhapdf6.cc:489:99: error: expected primary-expression before 'double'
         if (nf*nf == 1) mass = lhapdf_amc::ACTIVESETS[nset].activemember()->info().get_entry_as<double>("MDown");
                                                                                                       ^
    pdf_lhapdf6.cc:489:99: error: expected ';' before 'double'
    pdf_lhapdf6.cc:490:63: error: 'std::map<int, lhapdf_amc::PDFSetHandler>::mapped_type' has no member named 'activemember'
         else if (nf*nf == 4) mass = lhapdf_amc::ACTIVESETS[nset].activemember()->info().get_entry_as<double>("MUp");
                                                                   ^
    pdf_lhapdf6.cc:490:99: error: expected primary-expression before 'double'
         else if (nf*nf == 4) mass = lhapdf_amc::ACTIVESETS[nset].activemember()->info().get_entry_as<double>("MUp");
                                                                                                       ^
    pdf_lhapdf6.cc:490:99: error: expected ';' before 'double'
    pdf_lhapdf6.cc:491:63: error: 'std::map<int, lhapdf_amc::PDFSetHandler>::mapped_type' has no member named 'activemember'
         else if (nf*nf == 9) mass = lhapdf_amc::ACTIVESETS[nset].activemember()->info().get_entry_as<double>("MStrange");
                                                                   ^
    pdf_lhapdf6.cc:491:99: error: expected primary-expression before 'double'
         else if (nf*nf == 9) mass = lhapdf_amc::ACTIVESETS[nset].activemember()->info().get_entry_as<double>("MStrange");
                                                                                                       ^
    pdf_lhapdf6.cc:491:99: error: expected ';' before 'double'
    pdf_lhapdf6.cc:492:63: error: 'std::map<int, lhapdf_amc::PDFSetHandler>::mapped_type' has no member named 'activemember'
         else if (nf*nf == 16) mass = lhapdf_amc::ACTIVESETS[nset].activemember()->info().get_entry_as<double>("MCharm");
                                                                   ^
    pdf_lhapdf6.cc:492:99: error: expected primary-expression before 'double'
         else if (nf*nf == 16) mass = lhapdf_amc::ACTIVESETS[nset].activemember()->info().get_entry_as<double>("MCharm");
                                                                                                       ^
    pdf_lhapdf6.cc:492:99: error: expected ';' before 'double'
    pdf_lhapdf6.cc:493:63: error: 'std::map<int, lhapdf_amc::PDFSetHandler>::mapped_type' has no member named 'activemember'
         else if (nf*nf == 25) mass = lhapdf_amc::ACTIVESETS[nset].activemember()->info().get_entry_as<double>("MBottom");
                                                                   ^
    pdf_lhapdf6.cc:493:99: error: expected primary-expression before 'double'
         else if (nf*nf == 25) mass = lhapdf_amc::ACTIVESETS[nset].activemember()->info().get_entry_as<double>("MBottom");
                                                                                                       ^
    pdf_lhapdf6.cc:493:99: error: expected ';' before 'double'
    pdf_lhapdf6.cc:494:63: error: 'std::map<int, lhapdf_amc::PDFSetHandler>::mapped_type' has no member named 'activemember'
         else if (nf*nf == 36) mass = lhapdf_amc::ACTIVESETS[nset].activemember()->info().get_entry_as<double>("MTop");
                                                                   ^
    pdf_lhapdf6.cc:494:99: error: expected primary-expression before 'double'
         else if (nf*nf == 36) mass = lhapdf_amc::ACTIVESETS[nset].activemember()->info().get_entry_as<double>("MTop");
                                                                                                       ^
    pdf_lhapdf6.cc:494:99: error: expected ';' before 'double'
    pdf_lhapdf6.cc: In function 'void getthresholdm_(const int&, const int&, double&)':
    pdf_lhapdf6.cc:511:62: error: 'std::map<int, lhapdf_amc::PDFSetHandler>::mapped_type' has no member named 'activemember'
           if (nf*nf == 1) Q = lhapdf_amc::ACTIVESETS[nset].activemember()->info().get_entry_as<double>("ThresholdDown");
                                                                  ^
    pdf_lhapdf6.cc:511:98: error: expected primary-expression before 'double'
           if (nf*nf == 1) Q = lhapdf_amc::ACTIVESETS[nset].activemember()->info().get_entry_as<double>("ThresholdDown");
                                                                                                      ^
    pdf_lhapdf6.cc:511:98: error: expected ';' before 'double'
    pdf_lhapdf6.cc:512:62: error: 'std::map<int, lhapdf_amc::PDFSetHandler>::mapped_type' has no member named 'activemember'
           else if (nf*nf == 4) Q = lhapdf_amc::ACTIVESETS[nset].activemember()->info().get_entry_as<double>("ThresholdUp");
                                                                  ^
    pdf_lhapdf6.cc:512:98: error: expected primary-expression before 'double'
           else if (nf*nf == 4) Q = lhapdf_amc::ACTIVESETS[nset].activemember()->info().get_entry_as<double>("ThresholdUp");
                                                                                                      ^
    pdf_lhapdf6.cc:512:98: error: expected ';' before 'double'
    pdf_lhapdf6.cc:513:62: error: 'std::map<int, lhapdf_amc::PDFSetHandler>::mapped_type' has no member named 'activemember'
           else if (nf*nf == 9) Q = lhapdf_amc::ACTIVESETS[nset].activemember()->info().get_entry_as<double>("ThresholdStrange");
                                                                  ^
    pdf_lhapdf6.cc:513:98: error: expected primary-expression before 'double'
           else if (nf*nf == 9) Q = lhapdf_amc::ACTIVESETS[nset].activemember()->info().get_entry_as<double>("ThresholdStrange");
                                                                                                      ^
    pdf_lhapdf6.cc:513:98: error: expected ';' before 'double'
    pdf_lhapdf6.cc:514:62: error: 'std::map<int, lhapdf_amc::PDFSetHandler>::mapped_type' has no member named 'activemember'
           else if (nf*nf == 16) Q = lhapdf_amc::ACTIVESETS[nset].activemember()->info().get_entry_as<double>("ThresholdCharm");
                                                                  ^
    pdf_lhapdf6.cc:514:98: error: expected primary-expression before 'double'
           else if (nf*nf == 16) Q = lhapdf_amc::ACTIVESETS[nset].activemember()->info().get_entry_as<double>("ThresholdCharm");
                                                                                                      ^
    pdf_lhapdf6.cc:514:98: error: expected ';' before 'double'
    pdf_lhapdf6.cc:515:62: error: 'std::map<int, lhapdf_amc::PDFSetHandler>::mapped_type' has no member named 'activemember'
           else if (nf*nf == 25) Q = lhapdf_amc::ACTIVESETS[nset].activemember()->info().get_entry_as<double>("ThresholdBottom");
                                                                  ^
    pdf_lhapdf6.cc:515:98: error: expected primary-expression before 'double'
           else if (nf*nf == 25) Q = lhapdf_amc::ACTIVESETS[nset].activemember()->info().get_entry_as<double>("ThresholdBottom");
                                                                                                      ^
    pdf_lhapdf6.cc:515:98: error: expected ';' before 'double'
    pdf_lhapdf6.cc:516:62: error: 'std::map<int, lhapdf_amc::PDFSetHandler>::mapped_type' has no member named 'activemember'
           else if (nf*nf == 36) Q = lhapdf_amc::ACTIVESETS[nset].activemember()->info().get_entry_as<double>("ThresholdTop");
                                                                  ^
    pdf_lhapdf6.cc:516:98: error: expected primary-expression before 'double'
           else if (nf*nf == 36) Q = lhapdf_amc::ACTIVESETS[nset].activemember()->info().get_entry_as<double>("ThresholdTop");
                                                                                                      ^
    pdf_lhapdf6.cc:516:98: error: expected ';' before 'double'
    pdf_lhapdf6.cc: In function 'void getdescm_(const int&)':
    pdf_lhapdf6.cc:535:42: error: 'std::map<int, lhapdf_amc::PDFSetHandler>::mapped_type' has no member named 'activemember'
         cout << lhapdf_amc::ACTIVESETS[nset].activemember()->description() << endl;
                                              ^
    pdf_lhapdf6.cc: In function 'void getxminm_(const int&, const int&, double&)':
    pdf_lhapdf6.cc:550:41: error: 'std::map<int, lhapdf_amc::PDFSetHandler>::mapped_type' has no member named 'activemember'
         xmin = lhapdf_amc::ACTIVESETS[nset].activemember()->info().get_entry_as<double>("XMin");
                                             ^
    pdf_lhapdf6.cc:550:77: error: expected primary-expression before 'double'
         xmin = lhapdf_amc::ACTIVESETS[nset].activemember()->info().get_entry_as<double>("XMin");
                                                                                 ^
    pdf_lhapdf6.cc:550:77: error: expected ';' before 'double'
    pdf_lhapdf6.cc: In function 'void getxmaxm_(const int&, const int&, double&)':
    pdf_lhapdf6.cc:566:41: error: 'std::map<int, lhapdf_amc::PDFSetHandler>::mapped_type' has no member named 'activemember'
         xmax = lhapdf_amc::ACTIVESETS[nset].activemember()->info().get_entry_as<double>("XMax");
                                             ^
    pdf_lhapdf6.cc:566:77: error: expected primary-expression before 'double'
         xmax = lhapdf_amc::ACTIVESETS[nset].activemember()->info().get_entry_as<double>("XMax");
                                                                                 ^
    pdf_lhapdf6.cc:566:77: error: expected ';' before 'double'
    pdf_lhapdf6.cc: In function 'void getq2minm_(const int&, const int&, double&)':
    pdf_lhapdf6.cc:582:54: error: 'std::map<int, lhapdf_amc::PDFSetHandler>::mapped_type' has no member named 'activemember'
         q2min = LHAPDF::sqr(lhapdf_amc::ACTIVESETS[nset].activemember()->info().get_entry_as<double>("QMin"));
                                                          ^
    pdf_lhapdf6.cc:582:90: error: expected primary-expression before 'double'
         q2min = LHAPDF::sqr(lhapdf_amc::ACTIVESETS[nset].activemember()->info().get_entry_as<double>("QMin"));
                                                                                              ^
    pdf_lhapdf6.cc: In function 'void getq2maxm_(const int&, const int&, double&)':
    pdf_lhapdf6.cc:598:54: error: 'std::map<int, lhapdf_amc::PDFSetHandler>::mapped_type' has no member named 'activemember'
         q2max = LHAPDF::sqr(lhapdf_amc::ACTIVESETS[nset].activemember()->info().get_entry_as<double>("QMax"));
                                                          ^
    pdf_lhapdf6.cc:598:90: error: expected primary-expression before 'double'
         q2max = LHAPDF::sqr(lhapdf_amc::ACTIVESETS[nset].activemember()->info().get_entry_as<double>("QMax"));
                                                                                              ^
    pdf_lhapdf6.cc: In function 'void getminmaxm_(const int&, const int&, double&, double&, double&, double&)':
    pdf_lhapdf6.cc:614:41: error: 'std::map<int, lhapdf_amc::PDFSetHandler>::mapped_type' has no member named 'activemember'
         xmin = lhapdf_amc::ACTIVESETS[nset].activemember()->info().get_entry_as<double>("XMin");
                                             ^
    pdf_lhapdf6.cc:614:77: error: expected primary-expression before 'double'
         xmin = lhapdf_amc::ACTIVESETS[nset].activemember()->info().get_entry_as<double>("XMin");
                                                                                 ^
    pdf_lhapdf6.cc:614:77: error: expected ';' before 'double'
    pdf_lhapdf6.cc:615:41: error: 'std::map<int, lhapdf_amc::PDFSetHandler>::mapped_type' has no member named 'activemember'
         xmax = lhapdf_amc::ACTIVESETS[nset].activemember()->info().get_entry_as<double>("XMax");
                                             ^
    pdf_lhapdf6.cc:615:77: error: expected primary-expression before 'double'
         xmax = lhapdf_amc::ACTIVESETS[nset].activemember()->info().get_entry_as<double>("XMax");
                                                                                 ^
    pdf_lhapdf6.cc:615:77: error: expected ';' before 'double'
    pdf_lhapdf6.cc:616:54: error: 'std::map<int, lhapdf_amc::PDFSetHandler>::mapped_type' has no member named 'activemember'
         q2min = LHAPDF::sqr(lhapdf_amc::ACTIVESETS[nset].activemember()->info().get_entry_as<double>("QMin"));
                                                          ^
    pdf_lhapdf6.cc:616:90: error: expected primary-expression before 'double'
         q2min = LHAPDF::sqr(lhapdf_amc::ACTIVESETS[nset].activemember()->info().get_entry_as<double>("QMin"));
                                                                                              ^
    pdf_lhapdf6.cc:617:54: error: 'std::map<int, lhapdf_amc::PDFSetHandler>::mapped_type' has no member named 'activemember'
         q2max = LHAPDF::sqr(lhapdf_amc::ACTIVESETS[nset].activemember()->info().get_entry_as<double>("QMax"));
                                                          ^
    pdf_lhapdf6.cc:617:90: error: expected primary-expression before 'double'
         q2max = LHAPDF::sqr(lhapdf_amc::ACTIVESETS[nset].activemember()->info().get_entry_as<double>("QMax"));
                                                                                              ^
    pdf_lhapdf6.cc: In function 'void getpdfunctypem_(const int&, int&, int&)':
    pdf_lhapdf6.cc:636:59: error: 'std::map<int, lhapdf_amc::PDFSetHandler>::mapped_type' has no member named 'activemember'
         const string errorType = lhapdf_amc::ACTIVESETS[nset].activemember()->set().errorType();
                                                               ^
    pdf_lhapdf6.cc: In function 'void getpdfuncertaintym_(const int&, const double*, double&, double&, double&, double&)':
    pdf_lhapdf6.cc:661:54: error: 'std::map<int, lhapdf_amc::PDFSetHandler>::mapped_type' has no member named 'activemember'
         const size_t nmem = lhapdf_amc::ACTIVESETS[nset].activemember()->set().size()-1;
                                                          ^
    pdf_lhapdf6.cc:663:63: error: 'std::map<int, lhapdf_amc::PDFSetHandler>::mapped_type' has no member named 'activemember'
         LHAPDF::PDFUncertainty err = lhapdf_amc::ACTIVESETS[nset].activemember()->set().uncertainty(vecvalues, -1);
                                                                   ^
    pdf_lhapdf6.cc: In function 'void getpdfcorrelationm_(const int&, const double*, const double*, double&)':
    pdf_lhapdf6.cc:682:54: error: 'std::map<int, lhapdf_amc::PDFSetHandler>::mapped_type' has no member named 'activemember'
         const size_t nmem = lhapdf_amc::ACTIVESETS[nset].activemember()->set().size()-1;
                                                          ^
    pdf_lhapdf6.cc:685:48: error: 'std::map<int, lhapdf_amc::PDFSetHandler>::mapped_type' has no member named 'activemember'
         correlation = lhapdf_amc::ACTIVESETS[nset].activemember()->set().correlation(vecvaluesA,vecvaluesB);
                                                    ^
    pdf_lhapdf6.cc: In function 'void pdfset_(const char*, const double*, int)':
    pdf_lhapdf6.cc:727:5: error: 'PDFPtr' is not a member of 'lhapdf_amc'
         lhapdf_amc::PDFPtr pdf = lhapdf_amc::ACTIVESETS[1].activemember();
         ^
    pdf_lhapdf6.cc:727:24: error: expected ';' before 'pdf'
         lhapdf_amc::PDFPtr pdf = lhapdf_amc::ACTIVESETS[1].activemember();
                            ^
    pdf_lhapdf6.cc:728:20: error: 'pdf' was not declared in this scope
         w50513_.xmin = pdf->info().get_entry_as<double>("XMin", 0.0);
                        ^
    pdf_lhapdf6.cc:728:45: error: expected primary-expression before 'double'
         w50513_.xmin = pdf->info().get_entry_as<double>("XMin", 0.0);
                                                 ^
    pdf_lhapdf6.cc:728:45: error: expected ';' before 'double'
    pdf_lhapdf6.cc:729:45: error: expected primary-expression before 'double'
         w50513_.xmax = pdf->info().get_entry_as<double>("XMax", 1.0);
                                                 ^
    pdf_lhapdf6.cc:729:45: error: expected ';' before 'double'
    pdf_lhapdf6.cc:730:58: error: expected primary-expression before 'double'
         w50513_.q2min = LHAPDF::sqr(pdf->info().get_entry_as<double>("QMin", 1.0));
                                                              ^
    pdf_lhapdf6.cc:731:58: error: expected primary-expression before 'double'
         w50513_.q2max = LHAPDF::sqr(pdf->info().get_entry_as<double>("QMax", 1.0e5));
                                                              ^
    pdf_lhapdf6.cc:732:46: error: expected primary-expression before 'double'
         w50512_.qcdl4 = pdf->info().get_entry_as<double>("AlphaS_Lambda4", 0.0);
                                                  ^
    pdf_lhapdf6.cc:732:46: error: expected ';' before 'double'
    pdf_lhapdf6.cc:733:46: error: expected primary-expression before 'double'
         w50512_.qcdl5 = pdf->info().get_entry_as<double>("AlphaS_Lambda5", 0.0);
                                                  ^
    pdf_lhapdf6.cc:733:46: error: expected ';' before 'double'
    pdf_lhapdf6.cc:734:49: error: expected primary-expression before 'double'
         lhapdfr_.qcdlha4 = pdf->info().get_entry_as<double>("AlphaS_Lambda4", 0.0);
                                                     ^
    pdf_lhapdf6.cc:734:49: error: expected ';' before 'double'
    pdf_lhapdf6.cc:735:49: error: expected primary-expression before 'double'
         lhapdfr_.qcdlha5 = pdf->info().get_entry_as<double>("AlphaS_Lambda5", 0.0);
                                                     ^
    pdf_lhapdf6.cc:735:49: error: expected ';' before 'double'
    pdf_lhapdf6.cc:738:34: error: expected primary-expression before 'bool'
         if (pdf->info().get_entry_as<bool>("Pythia6LambdaV5Compat", true)) {
                                      ^
    pdf_lhapdf6.cc:738:34: error: expected ')' before 'bool'
    pdf_lhapdf6.cc: In function 'void structm_(const double&, const double&, double&, double&, double&, double&, double&, double&, double&, double&, double&)':
    pdf_lhapdf6.cc:752:5: error: 'PDFPtr' is not a member of 'lhapdf_amc'
         lhapdf_amc::PDFPtr pdf = lhapdf_amc::ACTIVESETS[1].activemember();
         ^
    pdf_lhapdf6.cc:752:24: error: expected ';' before 'pdf'
         lhapdf_amc::PDFPtr pdf = lhapdf_amc::ACTIVESETS[1].activemember();
                            ^
    pdf_lhapdf6.cc:753:12: error: 'pdf' was not declared in this scope
         dsea = pdf->xfxQ(-1, x, q);
                ^
    make[1]: *** [pdf_lhapdf6.o] Error 1
    make[1]: Leaving directory `/data9/Users/shjeon/gridpack_MG5_aMC_v2_6_0_copy1/MG5_aMC_v2_6_0/WRToNLep_MuMuJJ_WR400_N100_Tchannel_NLO/Source/PDF'
    make: *** [../lib/libpdf.a] Error 2

Please try to fix this compilations issue and retry.
Help might be found at https://answers.launchpad.net/mg5amcnlo.
If you think that this is a bug, you can report this at https://bugs.launchpad.net/mg5amcnlo
Value of current Options:
              text_editor : vi
      notification_center : True
                    pjfry : None
       cluster_local_path : None
       group_subprocesses : Auto
ignore_six_quark_processes : False
    loop_optimized_output : True
    cluster_status_update : (600, 30)
         fortran_compiler : None
               hepmc_path : None
                  collier : /data9/Users/shjeon/gridpack_MG5_aMC_v2_6_0/MG5_aMC_v2_6_0/HEPTools/lib
              auto_update : 7
             pythia8_path : None
                hwpp_path : None
low_mem_multicore_nlo_generation : False
                    golem : None
          pythia-pgs_path : None
                  td_path : None
             delphes_path : None
              thepeg_path : None
             cluster_type : sge
        madanalysis5_path : None
      exrootanalysis_path : None
                      OLP : MadLoop
                 applgrid : applgrid-config
               eps_viewer : None
                  fastjet : None
                 run_mode : 1
              web_browser : None
   automatic_html_opening : False
        cluster_temp_path : None
             cluster_size : 100
            cluster_queue : shortq
             syscalc_path : None
         madanalysis_path : None
                   lhapdf : /cvmfs/cms.cern.ch/slc6_amd64_gcc481/external/lhapdf/6.2.1-ddibom/bin/lhapdf-config
             stdout_level : 20
                  nb_core : 8
            f2py_compiler : /cvmfs/cms.cern.ch/slc6_amd64_gcc481/cms/cmssw/CMSSW_7_1_30/external/slc6_amd64_gcc481/bin/f2py
                    ninja : /data9/Users/shjeon/gridpack_MG5_aMC_v2_6_0/MG5_aMC_v2_6_0/HEPTools/lib
                  amcfast : amcfast-config
       cluster_retry_wait : 300
      output_dependencies : external
           crash_on_error : False
mg5amc_py8_interface_path : None
         loop_color_flows : False
                  samurai : None
         cluster_nb_retry : 1
                 mg5_path : /data9/Users/shjeon/gridpack_MG5_aMC_v2_6_0_copy1/MG5_aMC_v2_6_0
                  timeout : 60
                    gauge : unitary
      complex_mass_scheme : False
             cpp_compiler : None
   max_npoint_for_channel : 0
#************************************************************
#* MadGraph5_aMC@NLO *
#* *
#* * * *
#* * * * * *
#* * * * * 5 * * * * *
#* * * * * *
#* * * *
#* *
#* *
#* VERSION 2.6.0 2017-08-16 *
#* *
#* The MadGraph5_aMC@NLO Development Team - Find us at *
#* https://server06.fynu.ucl.ac.be/projects/madgraph *
#* *
#************************************************************
#* *
#* Command File for MadGraph5_aMC@NLO *
#* *
#* run as ./bin/mg5_aMC filename *
#* *
#************************************************************
set group_subprocesses Auto
set ignore_six_quark_processes False
set loop_optimized_output True
set loop_color_flows False
set gauge unitary
set complex_mass_scheme False
set max_npoint_for_channel 0
import model EffLRSM_NLO
define p = g u c d s u~ c~ d~ s~
define j = g u c d s u~ c~ d~ s~
define l+ = e+ mu+
define l- = e- mu-
define vl = ve vm vt
define vl~ = ve~ vm~ vt~
define p = 21 2 4 1 3 -2 -4 -1 -3 5 -5 # pass to 5 flavors
define j = p
define mu = mu+ mu-
generate p a > n2 mu j QCD=0 [QCD]
add process a p > n2 mu j QCD=0 [QCD]
output WRToNLep_MuMuJJ_WR400_N100_Tchannel_NLO
######################################################################
## PARAM_CARD AUTOMATICALY GENERATED BY MG5 ####
######################################################################
###################################
## INFORMATION FOR LOOP
###################################
BLOCK LOOP #
      1 9.118800e+01 # mu_r
###################################
## INFORMATION FOR MASS
###################################
BLOCK MASS #
      6 1.733000e+02 # mt
      23 9.118760e+01 # mz
      25 1.257000e+02 # mh
      32 1.000000e+14 # mzr
      34 4.000000e+02 # mwr
      9900012 1.000000e+14 # mn1
      9900014 1.000000e+02 # mn2
      9900016 1.000000e+14 # mn3
      1 0.000000e+00 # d : 0.0
      2 0.000000e+00 # u : 0.0
      3 0.000000e+00 # s : 0.0
      4 0.000000e+00 # c : 0.0
      5 0.000000e+00 # b : 0.0
      11 0.000000e+00 # e- : 0.0
      12 0.000000e+00 # ve : 0.0
      13 0.000000e+00 # mu- : 0.0
      14 0.000000e+00 # vm : 0.0
      15 0.000000e+00 # ta- : 0.0
      16 0.000000e+00 # vt : 0.0
      21 0.000000e+00 # g : 0.0
      22 0.000000e+00 # a : 0.0
      24 7.995123e+01 # w+ : cmath.sqrt(mz__exp__2/2. + cmath.sqrt(mz__exp__4/4. - (aew*cmath.pi*mz__exp__2)/(gf*sqrt__2)))
      9000002 9.118760e+01 # ghz : mz
      9000003 7.995123e+01 # ghwp : mw
      9000004 7.995123e+01 # ghwm : mw
###################################
## INFORMATION FOR SMINPUTS
###################################
BLOCK SMINPUTS #
      1 1.279400e+02 # aewm1
      2 1.174560e-05 # gf
      3 1.184000e-01 # as
###################################
## INFORMATION FOR VRCOUP
###################################
BLOCK VRCOUP #
      1 1.000000e+00 # krq
      2 1.000000e+00 # krl
###################################
## INFORMATION FOR YUKAWA
###################################
BLOCK YUKAWA #
      6 1.733000e+02 # ymt
###################################
## INFORMATION FOR DECAY
###################################
BLOCK QNUMBERS 32 # zr
      1 0 # 3 times electric charge
      2 3 # number of spin states (2s+1)
      3 1 # colour rep (1: singlet, 3: triplet, 8: octet)
      4 0 # particle/antiparticle distinction (0=own anti)
###################################
## INFORMATION FOR QNUMBERS 34
###################################
BLOCK QNUMBERS 34 # wr+
      1 3 # 3 times electric charge
      2 3 # number of spin states (2s+1)
      3 1 # colour rep (1: singlet, 3: triplet, 8: octet)
      4 1 # particle/antiparticle distinction (0=own anti)
###################################
## INFORMATION FOR QNUMBERS 9900012
###################################
BLOCK QNUMBERS 9900012 # n1
      1 0 # 3 times electric charge
      2 2 # number of spin states (2s+1)
      3 1 # colour rep (1: singlet, 3: triplet, 8: octet)
      4 0 # particle/antiparticle distinction (0=own anti)
###################################
## INFORMATION FOR QNUMBERS 9900014
###################################
BLOCK QNUMBERS 9900014 # n2
      1 0 # 3 times electric charge
      2 2 # number of spin states (2s+1)
      3 1 # colour rep (1: singlet, 3: triplet, 8: octet)
      4 0 # particle/antiparticle distinction (0=own anti)
###################################
## INFORMATION FOR QNUMBERS 9900016
###################################
BLOCK QNUMBERS 9900016 # n3
      1 0 # 3 times electric charge
      2 2 # number of spin states (2s+1)
      3 1 # colour rep (1: singlet, 3: triplet, 8: octet)
      4 0 # particle/antiparticle distinction (0=own anti)
#
#*************************
# Decay widths *
#*************************
#
# PDG Width
DECAY 1 0.000000e+00
#
# PDG Width
DECAY 2 0.000000e+00
#
# PDG Width
DECAY 3 0.000000e+00
#
# PDG Width
DECAY 4 0.000000e+00
#
# PDG Width
DECAY 5 0.000000e+00
#
# PDG Width
DECAY 6 1.350000e+00
#
# PDG Width
DECAY 11 0.000000e+00
#
# PDG Width
DECAY 12 0.000000e+00
#
# PDG Width
DECAY 13 0.000000e+00
#
# PDG Width
DECAY 14 0.000000e+00
#
# PDG Width
DECAY 15 0.000000e+00
#
# PDG Width
DECAY 16 0.000000e+00
#
# PDG Width
DECAY 21 0.000000e+00
#
# PDG Width
DECAY 22 0.000000e+00
#
# PDG Width
DECAY 23 2.495200e+00
#
# PDG Width
DECAY 24 2.085000e+00
#
# PDG Width
DECAY 25 4.170000e-03
#
# PDG Width
DECAY 32 2.251863e+12
# BR NDA ID1 ID2 ...
   1.741945e-01 2 5 -5 # 3.92262149354e+11
   1.741945e-01 2 3 -3 # 3.92262149354e+11
   1.741945e-01 2 1 -1 # 3.92262149354e+11
   9.894192e-02 2 6 -6 # 2.22803648797e+11
   9.894192e-02 2 4 -4 # 2.22803648797e+11
   9.894192e-02 2 2 -2 # 2.22803648797e+11
   8.944502e-02 2 9900014 9900014 # 2.01417931072e+11
   2.228712e-02 2 15 -15 # 50187540904.6
   2.228712e-02 2 13 -13 # 50187540904.6
   2.228712e-02 2 11 -11 # 50187540904.6
   8.094774e-03 2 16 -16 # 18228322064.0
   8.094774e-03 2 14 -14 # 18228322064.0
   8.094774e-03 2 12 -12 # 18228322064.0
#
# PDG Width
DECAY 34 1.022008e+01
# BR NDA ID1 ID2 ...
   3.307018e-01 2 4 -3 # 3.37979710223
   3.307018e-01 2 2 -1 # 3.37979710223
   2.386835e-01 2 6 -5 # 2.43936317379
   9.991295e-02 2 9900014 -13 # 1.02111789893
#
# PDG Width
DECAY 9000002 2.495200e+00
#
# PDG Width
DECAY 9000003 2.085000e+00
#
# PDG Width
DECAY 9000004 2.085000e+00
#
# PDG Width
DECAY 9900012 2.120000e-08
#
# PDG Width
DECAY 9900014 4.441500e-06
# BR NDA ID1 ID2 ...
   2.512890e-01 3 -13 -2 1 # 1.1161000935e-06
   2.512890e-01 3 -13 -4 3 # 1.1161000935e-06
   2.487110e-01 3 -1 2 13 # 1.1046499065e-06
   2.487110e-01 3 -3 4 13 # 1.1046499065e-06
#
# PDG Width
DECAY 9900016 1.000000e+02
#***********************************************************************
# MadGraph5_aMC@NLO *
# *
# run_card.dat aMC@NLO *
# *
# This file is used to set the parameters of the run. *
# *
# Some notation/conventions: *
# *
# Lines starting with a hash (#) are info or comments *
# *
# mind the format: value = variable ! comment *
# *
# Some of the values of variables can be list. These can either be *
# comma or space separated. *
#***********************************************************************
#
#*******************
# Running parameters
#*******************
#
#***********************************************************************
# Tag name for the run (one word) *
#***********************************************************************
  tag_1 = run_tag ! name of the run
#***********************************************************************
# Number of LHE events (and their normalization) and the required *
# (relative) accuracy on the Xsec. *
# These values are ignored for fixed order runs *
#***********************************************************************
  1000 = nevents ! Number of unweighted events requested
  -1.0 = req_acc ! Required accuracy (-1=auto determined from nevents)
  -1 = nevt_job ! Max number of events per job in event generation.
                 ! (-1= no split).
#***********************************************************************
# Normalize the weights of LHE events such that they sum or average to *
# the total cross section *
#***********************************************************************
  average = event_norm ! valid settings: average, sum, bias
#***********************************************************************
# Number of points per itegration channel (ignored for aMC@NLO runs) *
#***********************************************************************
  0.01 = req_acc_fo ! Required accuracy (-1=ignored, and use the
                     ! number of points and iter. below)
# These numbers are ignored except if req_acc_FO is equal to -1
  5000 = npoints_fo_grid ! number of points to setup grids
  4 = niters_fo_grid ! number of iter. to setup grids
  10000 = npoints_fo ! number of points to compute Xsec
  6 = niters_fo ! number of iter. to compute Xsec
#***********************************************************************
# Random number seed *
#***********************************************************************
  0 = iseed ! rnd seed (0=assigned automatically=default))
#***********************************************************************
# Collider type and energy *
#***********************************************************************
  1 = lpp1 ! beam 1 type (0 = no PDF)
  1 = lpp2 ! beam 2 type (0 = no PDF)
  6500.0 = ebeam1 ! beam 1 energy in GeV
  6500.0 = ebeam2 ! beam 2 energy in GeV
#***********************************************************************
# PDF choice: this automatically fixes also alpha_s(MZ) and its evol. *
#***********************************************************************
  lhapdf = pdlabel ! PDF set
  82200 = lhaid ! If pdlabel=lhapdf, this is the lhapdf number. Only
              ! numbers for central PDF sets are allowed. Can be a list;
              ! PDF sets beyond the first are included via reweighting.
#***********************************************************************
# Include the NLO Monte Carlo subtr. terms for the following parton *
# shower (HERWIG6 | HERWIGPP | PYTHIA6Q | PYTHIA6PT | PYTHIA8) *
# WARNING: PYTHIA6PT works only for processes without FSR!!!! *
#***********************************************************************
  HERWIG6 = parton_shower
  1.0 = shower_scale_factor ! multiply default shower starting
                                  ! scale by this factor
#***********************************************************************
# Renormalization and factorization scales *
# (Default functional form for the non-fixed scales is the sum of *
# the transverse masses divided by two of all final state particles *
# and partons. This can be changed in SubProcesses/set_scales.f or via *
# dynamical_scale_choice option) *
#***********************************************************************
  False = fixed_ren_scale ! if .true. use fixed ren scale
  False = fixed_fac_scale ! if .true. use fixed fac scale
  91.118 = mur_ref_fixed ! fixed ren reference scale
  91.118 = muf_ref_fixed ! fixed fact reference scale
  -1 = dynamical_scale_choice ! Choose one (or more) of the predefined
           ! dynamical choices. Can be a list; scale choices beyond the
           ! first are included via reweighting
  1.0 = mur_over_ref ! ratio of current muR over reference muR
  1.0 = muf_over_ref ! ratio of current muF over reference muF
#***********************************************************************
# Reweight variables for scale dependence and PDF uncertainty *
#***********************************************************************
  1.0, 2.0, 0.5 = rw_rscale ! muR factors to be included by reweighting
  1.0, 2.0, 0.5 = rw_fscale ! muF factors to be included by reweighting
  False = reweight_scale ! Reweight to get scale variation using the
            ! rw_rscale and rw_fscale factors. Should be a list of
            ! booleans of equal length to dynamical_scale_choice to
            ! specify for which choice to include scale dependence.
  False = reweight_pdf ! Reweight to get PDF uncertainty. Should be a
            ! list booleans of equal length to lhaid to specify for
            ! which PDF set to include the uncertainties.
#***********************************************************************
# Store reweight information in the LHE file for off-line model- *
# parameter reweighting at NLO+PS accuracy *
#***********************************************************************
  False = store_rwgt_info ! Store info for reweighting in LHE file
#***********************************************************************
# ickkw parameter: *
# 0: No merging *
# 3: FxFx Merging - WARNING! Applies merging only at the hard-event *
# level. After showering an MLM-type merging should be applied as *
# well. See http://amcatnlo.cern.ch/FxFx_merging.htm for details. *
# 4: UNLOPS merging (with pythia8 only). No interface from within *
# MG5_aMC available, but available in Pythia8. *
# -1: NNLL+NLO jet-veto computation. See arxiv:1412.8408 [hep-ph]. *
#***********************************************************************
  0 = ickkw
#***********************************************************************
#
#***********************************************************************
# BW cutoff (M+/-bwcutoff*Gamma). Determines which resonances are *
# written in the LHE event file *
#***********************************************************************
  15.0 = bwcutoff
#***********************************************************************
# Cuts on the jets. Jet clustering is performed by FastJet. *
# - When matching to a parton shower, these generation cuts should be *
# considerably softer than the analysis cuts. *
# - More specific cuts can be specified in SubProcesses/cuts.f *
#***********************************************************************
  1.0 = jetalgo ! FastJet jet algorithm (1=kT, 0=C/A, -1=anti-kT)
  0.7 = jetradius ! The radius parameter for the jet algorithm
  0.0 = ptj ! Min jet transverse momentum
  -1.0 = etaj ! Max jet abs(pseudo-rap) (a value .lt.0 means no cut)
#***********************************************************************
# Cuts on the charged leptons (e+, e-, mu+, mu-, tau+ and tau-) *
# More specific cuts can be specified in SubProcesses/cuts.f *
#***********************************************************************
  0.0 = ptl ! Min lepton transverse momentum
  -1.0 = etal ! Max lepton abs(pseudo-rap) (a value .lt.0 means no cut)
  0.0 = drll ! Min distance between opposite sign lepton pairs
  0.0 = drll_sf ! Min distance between opp. sign same-flavor lepton pairs
  0.0 = mll ! Min inv. mass of all opposite sign lepton pairs
  0.0 = mll_sf ! Min inv. mass of all opp. sign same-flavor lepton pairs
#***********************************************************************
# Photon-isolation cuts, according to hep-ph/9801442. When ptgmin=0, *
# all the other parameters are ignored. *
# More specific cuts can be specified in SubProcesses/cuts.f *
#***********************************************************************
  0.0 = ptgmin ! Min photon transverse momentum
  -1.0 = etagamma ! Max photon abs(pseudo-rap)
  0.4 = r0gamma ! Radius of isolation code
  1.0 = xn ! n parameter of eq.(3.4) in hep-ph/9801442
  1.0 = epsgamma ! epsilon_gamma parameter of eq.(3.4) in hep-ph/9801442
  True = isoem ! isolate photons from EM energy (photons and leptons)
#***********************************************************************
# For aMCfast+APPLGRID use in PDF fitting (http://amcfast.hepforge.org)*
#***********************************************************************
  0 = iappl ! aMCfast switch (0=OFF, 1=prepare grids, 2=fill grids)
#***********************************************************************

Question information

Language:
English Edit question
Status:
Solved
For:
MadGraph5_aMC@NLO Edit question
Assignee:
No assignee Edit question
Solved by:
Olivier Mattelaer
Solved:
2018-03-15
Last query:
2018-03-15
Last reply:
2018-03-10

Hi,

lhapdf 6.2.1 is not compatible with MG5aMC 2.6.0.

You need at least 2.6.1

Cheers,

Olivier

> On 10 Mar 2018, at 06:43, Sihyun Jeon <email address hidden> wrote:
>
> New question #665444 on MadGraph5_aMC@NLO:
> https://answers.launchpad.net/mg5amcnlo/+question/665444
>
> Hi MadGraph authors,
>
> I have been receiving this error message and I don't have any clue what the problem is.
>
> Please take a look and help me with this issue!
>
>
>
> Thanks, Sihyun Jeon.
>
> #************************************************************
> #* MadGraph5_aMC@NLO *
> #* *
> #* * * *
> #* * * * * *
> #* * * * * 5 * * * * *
> #* * * * * *
> #* * * *
> #* *
> #* *
> #* VERSION 2.6.0 2017-08-16 *
> #* *
> #* The MadGraph5_aMC@NLO Development Team - Find us at *
> #* https://server06.fynu.ucl.ac.be/projects/madgraph *
> #* and *
> #* http://amcatnlo.cern.ch *
> #* *
> #************************************************************
> #* *
> #* Command File for aMCatNLO *
> #* *
> #* run as ./bin/aMCatNLO.py filename *
> #* *
> #************************************************************
> launch auto
> Traceback (most recent call last):
> File "/data9/Users/shjeon/gridpack_MG5_aMC_v2_6_0_copy1/MG5_aMC_v2_6_0/madgraph/interface/extended_cmd.py", line 1438, in onecmd
> return self.onecmd_orig(line, **opt)
> File "/data9/Users/shjeon/gridpack_MG5_aMC_v2_6_0_copy1/MG5_aMC_v2_6_0/madgraph/interface/extended_cmd.py", line 1392, in onecmd_orig
> return func(arg, **opt)
> File "/data9/Users/shjeon/gridpack_MG5_aMC_v2_6_0_copy1/MG5_aMC_v2_6_0/madgraph/interface/amcatnlo_run_interface.py", line 1228, in do_launch
> self.compile(mode, options)
> File "/data9/Users/shjeon/gridpack_MG5_aMC_v2_6_0_copy1/MG5_aMC_v2_6_0/madgraph/interface/amcatnlo_run_interface.py", line 4595, in compile
> misc.compile(cwd = sourcedir)
> File "/data9/Users/shjeon/gridpack_MG5_aMC_v2_6_0_copy1/MG5_aMC_v2_6_0/madgraph/various/misc.py", line 479, in compile
> raise MadGraph5Error, error_text
> MadGraph5Error: A compilation Error occurs when trying to compile /data9/Users/shjeon/gridpack_MG5_aMC_v2_6_0_copy1/MG5_aMC_v2_6_0/WRToNLep_MuMuJJ_WR400_N100_Tchannel_NLO/Source.
> The compilation fails with the following output message:
> rm -f ../lib/libdhelas.a
> cd DHELAS; make
> make[1]: Entering directory `/data9/Users/shjeon/gridpack_MG5_aMC_v2_6_0_copy1/MG5_aMC_v2_6_0/WRToNLep_MuMuJJ_WR400_N100_Tchannel_NLO/Source/DHELAS'
> gfortran -O -fno-automatic -ffixed-line-length-132 -c -o aloha_functions.o aloha_functions.f
> aloha_functions.f:483.25:
>
> ip = nhel * -1 * ((1-nh)/2)
> 1
> Warning: Extension: Unary operator following arithmetic operator (use parentheses) at (1)
> aloha_functions.f:2307.27:
>
> CALL ILXXXX(Q(0),M,-1,1,W(1))
> 1
> Warning: Type mismatch in argument 'ffmass' at (1); passed COMPLEX(8) to REAL(8)
> aloha_functions.f:2310.27:
>
> CALL ILXXXX(Q(0),M,-1,-1,W(1))
> 1
> Warning: Type mismatch in argument 'ffmass' at (1); passed COMPLEX(8) to REAL(8)
> aloha_functions.f:2318.27:
>
> CALL ILXXXX(Q(0),M,1,1,W(1))
> 1
> Warning: Type mismatch in argument 'ffmass' at (1); passed COMPLEX(8) to REAL(8)
> aloha_functions.f:2321.27:
>
> CALL ILXXXX(Q(0),M,1,-1,W(1))
> 1
> Warning: Type mismatch in argument 'ffmass' at (1); passed COMPLEX(8) to REAL(8)
> aloha_functions.f:2326.27:
>
> CALL OLXXXX(Q(0),M,-1,-1,W(1))
> 1
> Warning: Type mismatch in argument 'ffmass' at (1); passed COMPLEX(8) to REAL(8)
> aloha_functions.f:2329.27:
>
> CALL OLXXXX(Q(0),M,-1,1,W(1))
> 1
> Warning: Type mismatch in argument 'ffmass' at (1); passed COMPLEX(8) to REAL(8)
> aloha_functions.f:2334.27:
>
> CALL OLXXXX(Q(0),M,1,-1,W(1))
> 1
> Warning: Type mismatch in argument 'ffmass' at (1); passed COMPLEX(8) to REAL(8)
> aloha_functions.f:2337.27:
>
> CALL OLXXXX(Q(0),M,1,1,W(1))
> 1
> Warning: Type mismatch in argument 'ffmass' at (1); passed COMPLEX(8) to REAL(8)
> aloha_functions.f:2567.27:
>
> CALL ICLXXX(Q(0),M,-1,1,W(1))
> 1
> Warning: Type mismatch in argument 'ffmass' at (1); passed COMPLEX(8) to REAL(8)
> aloha_functions.f:2570.27:
>
> CALL ICLXXX(Q(0),M,-1,-1,W(1))
> 1
> Warning: Type mismatch in argument 'ffmass' at (1); passed COMPLEX(8) to REAL(8)
> aloha_functions.f:2575.27:
>
> CALL ICLXXX(Q(0),M,1,1,W(1))
> 1
> Warning: Type mismatch in argument 'ffmass' at (1); passed COMPLEX(8) to REAL(8)
> aloha_functions.f:2578.27:
>
> CALL ICLXXX(Q(0),M,1,-1,W(1))
> 1
> Warning: Type mismatch in argument 'ffmass' at (1); passed COMPLEX(8) to REAL(8)
> aloha_functions.f:2583.27:
>
> CALL OCLXXX(Q(0),M,-1,-1,W(1))
> 1
> Warning: Type mismatch in argument 'ffmass' at (1); passed COMPLEX(8) to REAL(8)
> aloha_functions.f:2586.27:
>
> CALL OCLXXX(Q(0),M,-1,1,W(1))
> 1
> Warning: Type mismatch in argument 'ffmass' at (1); passed COMPLEX(8) to REAL(8)
> aloha_functions.f:2591.27:
>
> CALL OCLXXX(Q(0),M,1,-1,W(1))
> 1
> Warning: Type mismatch in argument 'ffmass' at (1); passed COMPLEX(8) to REAL(8)
> aloha_functions.f:2594.27:
>
> CALL OCLXXX(Q(0),M,1,1,W(1))
> 1
> Warning: Type mismatch in argument 'ffmass' at (1); passed COMPLEX(8) to REAL(8)
> gfortran -O -fno-automatic -ffixed-line-length-132 -c -o FFV1_3_4_2.o FFV1_3_4_2.f
> gfortran -O -fno-automatic -ffixed-line-length-132 -c -o MP_FFV1_3_4_2.o MP_FFV1_3_4_2.f
> gfortran -O -fno-automatic -ffixed-line-length-132 -c -o FFV4_0.o FFV4_0.f
> gfortran -O -fno-automatic -ffixed-line-length-132 -c -o MP_FFV4_0.o MP_FFV4_0.f
> gfortran -O -fno-automatic -ffixed-line-length-132 -c -o FFV1_2.o FFV1_2.f
> gfortran -O -fno-automatic -ffixed-line-length-132 -c -o MP_FFV1_2.o MP_FFV1_2.f
> gfortran -O -fno-automatic -ffixed-line-length-132 -c -o FFV1_3_4L2P0_3.o FFV1_3_4L2P0_3.f
> gfortran -O -fno-automatic -ffixed-line-length-132 -c -o MP_FFV1_3_4L2P0_3.o MP_FFV1_3_4L2P0_3.f
> gfortran -O -fno-automatic -ffixed-line-length-132 -c -o FFV1L2P0_3.o FFV1L2P0_3.f
> FFV1L2P0_3.f:21.26:
>
> COEFF(1,0,1)= COUP*-CI * F1(7)
> 1
> Warning: Extension: Unary operator following arithmetic operator (use parentheses) at (1)
> FFV1L2P0_3.f:22.26:
>
> COEFF(2,0,1)= COUP*-CI * F1(8)
> 1
> Warning: Extension: Unary operator following arithmetic operator (use parentheses) at (1)
> FFV1L2P0_3.f:23.26:
>
> COEFF(3,0,1)= COUP*-F1(8)
> 1
> Warning: Extension: Unary operator following arithmetic operator (use parentheses) at (1)
> FFV1L2P0_3.f:24.26:
>
> COEFF(4,0,1)= COUP*-CI * F1(7)
> 1
> Warning: Extension: Unary operator following arithmetic operator (use parentheses) at (1)
> FFV1L2P0_3.f:25.26:
>
> COEFF(1,0,2)= COUP*-CI * F1(8)
> 1
> Warning: Extension: Unary operator following arithmetic operator (use parentheses) at (1)
> FFV1L2P0_3.f:26.26:
>
> COEFF(2,0,2)= COUP*-CI * F1(7)
> 1
> Warning: Extension: Unary operator following arithmetic operator (use parentheses) at (1)
> FFV1L2P0_3.f:29.26:
>
> COEFF(1,0,3)= COUP*-CI * F1(5)
> 1
> Warning: Extension: Unary operator following arithmetic operator (use parentheses) at (1)
> FFV1L2P0_3.f:33.26:
>
> COEFF(1,0,4)= COUP*-CI * F1(6)
> 1
> Warning: Extension: Unary operator following arithmetic operator (use parentheses) at (1)
> FFV1L2P0_3.f:35.26:
>
> COEFF(3,0,4)= COUP*-F1(5)
> 1
> Warning: Extension: Unary operator following arithmetic operator (use parentheses) at (1)
> FFV1L2P0_3.f:36.26:
>
> COEFF(4,0,4)= COUP*-CI * F1(6)
> 1
> Warning: Extension: Unary operator following arithmetic operator (use parentheses) at (1)
> gfortran -O -fno-automatic -ffixed-line-length-132 -c -o MP_FFV1L2P0_3.o MP_FFV1L2P0_3.f
> MP_FFV1L2P0_3.f:21.26:
>
> COEFF(1,0,1)= COUP*-CI * F1(7)
> 1
> Warning: Extension: Unary operator following arithmetic operator (use parentheses) at (1)
> MP_FFV1L2P0_3.f:22.26:
>
> COEFF(2,0,1)= COUP*-CI * F1(8)
> 1
> Warning: Extension: Unary operator following arithmetic operator (use parentheses) at (1)
> MP_FFV1L2P0_3.f:23.26:
>
> COEFF(3,0,1)= COUP*-F1(8)
> 1
> Warning: Extension: Unary operator following arithmetic operator (use parentheses) at (1)
> MP_FFV1L2P0_3.f:24.26:
>
> COEFF(4,0,1)= COUP*-CI * F1(7)
> 1
> Warning: Extension: Unary operator following arithmetic operator (use parentheses) at (1)
> MP_FFV1L2P0_3.f:25.26:
>
> COEFF(1,0,2)= COUP*-CI * F1(8)
> 1
> Warning: Extension: Unary operator following arithmetic operator (use parentheses) at (1)
> MP_FFV1L2P0_3.f:26.26:
>
> COEFF(2,0,2)= COUP*-CI * F1(7)
> 1
> Warning: Extension: Unary operator following arithmetic operator (use parentheses) at (1)
> MP_FFV1L2P0_3.f:29.26:
>
> COEFF(1,0,3)= COUP*-CI * F1(5)
> 1
> Warning: Extension: Unary operator following arithmetic operator (use parentheses) at (1)
> MP_FFV1L2P0_3.f:33.26:
>
> COEFF(1,0,4)= COUP*-CI * F1(6)
> 1
> Warning: Extension: Unary operator following arithmetic operator (use parentheses) at (1)
> MP_FFV1L2P0_3.f:35.26:
>
> COEFF(3,0,4)= COUP*-F1(5)
> 1
> Warning: Extension: Unary operator following arithmetic operator (use parentheses) at (1)
> MP_FFV1L2P0_3.f:36.26:
>
> COEFF(4,0,4)= COUP*-CI * F1(6)
> 1
> Warning: Extension: Unary operator following arithmetic operator (use parentheses) at (1)
> gfortran -O -fno-automatic -ffixed-line-length-132 -c -o FF1_0.o FF1_0.f
> gfortran -O -fno-automatic -ffixed-line-length-132 -c -o MP_FF1_0.o MP_FF1_0.f
> gfortran -O -fno-automatic -ffixed-line-length-132 -c -o FFV1_3_4L1_2.o FFV1_3_4L1_2.f
> gfortran -O -fno-automatic -ffixed-line-length-132 -c -o MP_FFV1_3_4L1_2.o MP_FFV1_3_4L1_2.f
> gfortran -O -fno-automatic -ffixed-line-length-132 -c -o FFV1L1P0_3.o FFV1L1P0_3.f
> FFV1L1P0_3.f:21.26:
>
> COEFF(1,0,1)= COUP*-CI * F2(7)
> 1
> Warning: Extension: Unary operator following arithmetic operator (use parentheses) at (1)
> FFV1L1P0_3.f:23.26:
>
> COEFF(3,0,1)= COUP*-F2(8)
> 1
> Warning: Extension: Unary operator following arithmetic operator (use parentheses) at (1)
> FFV1L1P0_3.f:25.26:
>
> COEFF(1,0,2)= COUP*-CI * F2(8)
> 1
> Warning: Extension: Unary operator following arithmetic operator (use parentheses) at (1)
> FFV1L1P0_3.f:28.26:
>
> COEFF(4,0,2)= COUP*-CI * F2(8)
> 1
> Warning: Extension: Unary operator following arithmetic operator (use parentheses) at (1)
> FFV1L1P0_3.f:29.26:
>
> COEFF(1,0,3)= COUP*-CI * F2(5)
> 1
> Warning: Extension: Unary operator following arithmetic operator (use parentheses) at (1)
> FFV1L1P0_3.f:30.26:
>
> COEFF(2,0,3)= COUP*-CI * F2(6)
> 1
> Warning: Extension: Unary operator following arithmetic operator (use parentheses) at (1)
> FFV1L1P0_3.f:32.26:
>
> COEFF(4,0,3)= COUP*-CI * F2(5)
> 1
> Warning: Extension: Unary operator following arithmetic operator (use parentheses) at (1)
> FFV1L1P0_3.f:33.26:
>
> COEFF(1,0,4)= COUP*-CI * F2(6)
> 1
> Warning: Extension: Unary operator following arithmetic operator (use parentheses) at (1)
> FFV1L1P0_3.f:34.26:
>
> COEFF(2,0,4)= COUP*-CI * F2(5)
> 1
> Warning: Extension: Unary operator following arithmetic operator (use parentheses) at (1)
> FFV1L1P0_3.f:35.26:
>
> COEFF(3,0,4)= COUP*-F2(5)
> 1
> Warning: Extension: Unary operator following arithmetic operator (use parentheses) at (1)
> gfortran -O -fno-automatic -ffixed-line-length-132 -c -o MP_FFV1L1P0_3.o MP_FFV1L1P0_3.f
> MP_FFV1L1P0_3.f:21.26:
>
> COEFF(1,0,1)= COUP*-CI * F2(7)
> 1
> Warning: Extension: Unary operator following arithmetic operator (use parentheses) at (1)
> MP_FFV1L1P0_3.f:23.26:
>
> COEFF(3,0,1)= COUP*-F2(8)
> 1
> Warning: Extension: Unary operator following arithmetic operator (use parentheses) at (1)
> MP_FFV1L1P0_3.f:25.26:
>
> COEFF(1,0,2)= COUP*-CI * F2(8)
> 1
> Warning: Extension: Unary operator following arithmetic operator (use parentheses) at (1)
> MP_FFV1L1P0_3.f:28.26:
>
> COEFF(4,0,2)= COUP*-CI * F2(8)
> 1
> Warning: Extension: Unary operator following arithmetic operator (use parentheses) at (1)
> MP_FFV1L1P0_3.f:29.26:
>
> COEFF(1,0,3)= COUP*-CI * F2(5)
> 1
> Warning: Extension: Unary operator following arithmetic operator (use parentheses) at (1)
> MP_FFV1L1P0_3.f:30.26:
>
> COEFF(2,0,3)= COUP*-CI * F2(6)
> 1
> Warning: Extension: Unary operator following arithmetic operator (use parentheses) at (1)
> MP_FFV1L1P0_3.f:32.26:
>
> COEFF(4,0,3)= COUP*-CI * F2(5)
> 1
> Warning: Extension: Unary operator following arithmetic operator (use parentheses) at (1)
> MP_FFV1L1P0_3.f:33.26:
>
> COEFF(1,0,4)= COUP*-CI * F2(6)
> 1
> Warning: Extension: Unary operator following arithmetic operator (use parentheses) at (1)
> MP_FFV1L1P0_3.f:34.26:
>
> COEFF(2,0,4)= COUP*-CI * F2(5)
> 1
> Warning: Extension: Unary operator following arithmetic operator (use parentheses) at (1)
> MP_FFV1L1P0_3.f:35.26:
>
> COEFF(3,0,4)= COUP*-F2(5)
> 1
> Warning: Extension: Unary operator following arithmetic operator (use parentheses) at (1)
> gfortran -O -fno-automatic -ffixed-line-length-132 -c -o FFV3_0.o FFV3_0.f
> gfortran -O -fno-automatic -ffixed-line-length-132 -c -o MP_FFV3_0.o MP_FFV3_0.f
> gfortran -O -fno-automatic -ffixed-line-length-132 -c -o FFV1L3_2.o FFV1L3_2.f
> FFV1L3_2.f:29.26:
>
> COEFF(1,1,1)= COUP*-CI * F1(5)
> 1
> Warning: Extension: Unary operator following arithmetic operator (use parentheses) at (1)
> FFV1L3_2.f:30.26:
>
> COEFF(2,1,1)= COUP*-CI * F1(6)
> 1
> Warning: Extension: Unary operator following arithmetic operator (use parentheses) at (1)
> FFV1L3_2.f:31.26:
>
> COEFF(3,1,1)= COUP*-CI * F1(7)
> 1
> Warning: Extension: Unary operator following arithmetic operator (use parentheses) at (1)
> FFV1L3_2.f:32.26:
>
> COEFF(4,1,1)= COUP*-CI * F1(8)
> 1
> Warning: Extension: Unary operator following arithmetic operator (use parentheses) at (1)
> FFV1L3_2.f:35.26:
>
> COEFF(3,2,1)= COUP*-CI * F1(8)
> 1
> Warning: Extension: Unary operator following arithmetic operator (use parentheses) at (1)
> FFV1L3_2.f:36.26:
>
> COEFF(4,2,1)= COUP*-CI * F1(7)
> 1
> Warning: Extension: Unary operator following arithmetic operator (use parentheses) at (1)
> FFV1L3_2.f:38.26:
>
> COEFF(2,3,1)= COUP*-F1(5)
> 1
> Warning: Extension: Unary operator following arithmetic operator (use parentheses) at (1)
> FFV1L3_2.f:39.26:
>
> COEFF(3,3,1)= COUP*-F1(8)
> 1
> Warning: Extension: Unary operator following arithmetic operator (use parentheses) at (1)
> FFV1L3_2.f:42.26:
>
> COEFF(2,4,1)= COUP*-CI * F1(6)
> 1
> Warning: Extension: Unary operator following arithmetic operator (use parentheses) at (1)
> FFV1L3_2.f:43.26:
>
> COEFF(3,4,1)= COUP*-CI * F1(7)
> 1
> Warning: Extension: Unary operator following arithmetic operator (use parentheses) at (1)
> FFV1L3_2.f:53.26:
>
> COEFF(1,1,2)= COUP*-CI * F1(6)
> 1
> Warning: Extension: Unary operator following arithmetic operator (use parentheses) at (1)
> FFV1L3_2.f:54.26:
>
> COEFF(2,1,2)= COUP*-CI * F1(5)
> 1
> Warning: Extension: Unary operator following arithmetic operator (use parentheses) at (1)
> FFV1L3_2.f:62.26:
>
> COEFF(2,3,2)= COUP*-F1(6)
> 1
> Warning: Extension: Unary operator following arithmetic operator (use parentheses) at (1)
> FFV1L3_2.f:64.26:
>
> COEFF(4,3,2)= COUP*-F1(8)
> 1
> Warning: Extension: Unary operator following arithmetic operator (use parentheses) at (1)
> FFV1L3_2.f:66.26:
>
> COEFF(2,4,2)= COUP*-CI * F1(5)
> 1
> Warning: Extension: Unary operator following arithmetic operator (use parentheses) at (1)
> FFV1L3_2.f:68.26:
>
> COEFF(4,4,2)= COUP*-CI * F1(7)
> 1
> Warning: Extension: Unary operator following arithmetic operator (use parentheses) at (1)
> FFV1L3_2.f:77.26:
>
> COEFF(1,1,3)= COUP*-F1(6)
> 1
> Warning: Extension: Unary operator following arithmetic operator (use parentheses) at (1)
> FFV1L3_2.f:80.26:
>
> COEFF(4,1,3)= COUP*-F1(7)
> 1
> Warning: Extension: Unary operator following arithmetic operator (use parentheses) at (1)
> FFV1L3_2.f:81.26:
>
> COEFF(1,2,3)= COUP*-F1(5)
> 1
> Warning: Extension: Unary operator following arithmetic operator (use parentheses) at (1)
> FFV1L3_2.f:83.26:
>
> COEFF(3,2,3)= COUP*-F1(7)
> 1
> Warning: Extension: Unary operator following arithmetic operator (use parentheses) at (1)
> FFV1L3_2.f:101.26:
>
> COEFF(1,1,4)= COUP*-CI * F1(5)
> 1
> Warning: Extension: Unary operator following arithmetic operator (use parentheses) at (1)
> FFV1L3_2.f:104.26:
>
> COEFF(4,1,4)= COUP*-CI * F1(8)
> 1
> Warning: Extension: Unary operator following arithmetic operator (use parentheses) at (1)
> FFV1L3_2.f:105.26:
>
> COEFF(1,2,4)= COUP*-CI * F1(6)
> 1
> Warning: Extension: Unary operator following arithmetic operator (use parentheses) at (1)
> FFV1L3_2.f:107.26:
>
> COEFF(3,2,4)= COUP*-CI * F1(8)
> 1
> Warning: Extension: Unary operator following arithmetic operator (use parentheses) at (1)
> FFV1L3_2.f:109.26:
>
> COEFF(1,3,4)= COUP*-F1(6)
> 1
> Warning: Extension: Unary operator following arithmetic operator (use parentheses) at (1)
> FFV1L3_2.f:110.26:
>
> COEFF(2,3,4)= COUP*-F1(5)
> 1
> Warning: Extension: Unary operator following arithmetic operator (use parentheses) at (1)
> FFV1L3_2.f:111.26:
>
> COEFF(3,3,4)= COUP*-F1(8)
> 1
> Warning: Extension: Unary operator following arithmetic operator (use parentheses) at (1)
> FFV1L3_2.f:112.26:
>
> COEFF(4,3,4)= COUP*-F1(7)
> 1
> Warning: Extension: Unary operator following arithmetic operator (use parentheses) at (1)
> gfortran -O -fno-automatic -ffixed-line-length-132 -c -o MP_FFV1L3_2.o MP_FFV1L3_2.f
> MP_FFV1L3_2.f:29.26:
>
> COEFF(1,1,1)= COUP*-CI * F1(5)
> 1
> Warning: Extension: Unary operator following arithmetic operator (use parentheses) at (1)
> MP_FFV1L3_2.f:30.26:
>
> COEFF(2,1,1)= COUP*-CI * F1(6)
> 1
> Warning: Extension: Unary operator following arithmetic operator (use parentheses) at (1)
> MP_FFV1L3_2.f:31.26:
>
> COEFF(3,1,1)= COUP*-CI * F1(7)
> 1
> Warning: Extension: Unary operator following arithmetic operator (use parentheses) at (1)
> MP_FFV1L3_2.f:32.26:
>
> COEFF(4,1,1)= COUP*-CI * F1(8)
> 1
> Warning: Extension: Unary operator following arithmetic operator (use parentheses) at (1)
> MP_FFV1L3_2.f:35.26:
>
> COEFF(3,2,1)= COUP*-CI * F1(8)
> 1
> Warning: Extension: Unary operator following arithmetic operator (use parentheses) at (1)
> MP_FFV1L3_2.f:36.26:
>
> COEFF(4,2,1)= COUP*-CI * F1(7)
> 1
> Warning: Extension: Unary operator following arithmetic operator (use parentheses) at (1)
> MP_FFV1L3_2.f:38.26:
>
> COEFF(2,3,1)= COUP*-F1(5)
> 1
> Warning: Extension: Unary operator following arithmetic operator (use parentheses) at (1)
> MP_FFV1L3_2.f:39.26:
>
> COEFF(3,3,1)= COUP*-F1(8)
> 1
> Warning: Extension: Unary operator following arithmetic operator (use parentheses) at (1)
> MP_FFV1L3_2.f:42.26:
>
> COEFF(2,4,1)= COUP*-CI * F1(6)
> 1
> Warning: Extension: Unary operator following arithmetic operator (use parentheses) at (1)
> MP_FFV1L3_2.f:43.26:
>
> COEFF(3,4,1)= COUP*-CI * F1(7)
> 1
> Warning: Extension: Unary operator following arithmetic operator (use parentheses) at (1)
> MP_FFV1L3_2.f:53.26:
>
> COEFF(1,1,2)= COUP*-CI * F1(6)
> 1
> Warning: Extension: Unary operator following arithmetic operator (use parentheses) at (1)
> MP_FFV1L3_2.f:54.26:
>
> COEFF(2,1,2)= COUP*-CI * F1(5)
> 1
> Warning: Extension: Unary operator following arithmetic operator (use parentheses) at (1)
> MP_FFV1L3_2.f:62.26:
>
> COEFF(2,3,2)= COUP*-F1(6)
> 1
> Warning: Extension: Unary operator following arithmetic operator (use parentheses) at (1)
> MP_FFV1L3_2.f:64.26:
>
> COEFF(4,3,2)= COUP*-F1(8)
> 1
> Warning: Extension: Unary operator following arithmetic operator (use parentheses) at (1)
> MP_FFV1L3_2.f:66.26:
>
> COEFF(2,4,2)= COUP*-CI * F1(5)
> 1
> Warning: Extension: Unary operator following arithmetic operator (use parentheses) at (1)
> MP_FFV1L3_2.f:68.26:
>
> COEFF(4,4,2)= COUP*-CI * F1(7)
> 1
> Warning: Extension: Unary operator following arithmetic operator (use parentheses) at (1)
> MP_FFV1L3_2.f:77.26:
>
> COEFF(1,1,3)= COUP*-F1(6)
> 1
> Warning: Extension: Unary operator following arithmetic operator (use parentheses) at (1)
> MP_FFV1L3_2.f:80.26:
>
> COEFF(4,1,3)= COUP*-F1(7)
> 1
> Warning: Extension: Unary operator following arithmetic operator (use parentheses) at (1)
> MP_FFV1L3_2.f:81.26:
>
> COEFF(1,2,3)= COUP*-F1(5)
> 1
> Warning: Extension: Unary operator following arithmetic operator (use parentheses) at (1)
> MP_FFV1L3_2.f:83.26:
>
> COEFF(3,2,3)= COUP*-F1(7)
> 1
> Warning: Extension: Unary operator following arithmetic operator (use parentheses) at (1)
> MP_FFV1L3_2.f:101.26:
>
> COEFF(1,1,4)= COUP*-CI * F1(5)
> 1
> Warning: Extension: Unary operator following arithmetic operator (use parentheses) at (1)
> MP_FFV1L3_2.f:104.26:
>
> COEFF(4,1,4)= COUP*-CI * F1(8)
> 1
> Warning: Extension: Unary operator following arithmetic operator (use parentheses) at (1)
> MP_FFV1L3_2.f:105.26:
>
> COEFF(1,2,4)= COUP*-CI * F1(6)
> 1
> Warning: Extension: Unary operator following arithmetic operator (use parentheses) at (1)
> MP_FFV1L3_2.f:107.26:
>
> COEFF(3,2,4)= COUP*-CI * F1(8)
> 1
> Warning: Extension: Unary operator following arithmetic operator (use parentheses) at (1)
> MP_FFV1L3_2.f:109.26:
>
> COEFF(1,3,4)= COUP*-F1(6)
> 1
> Warning: Extension: Unary operator following arithmetic operator (use parentheses) at (1)
> MP_FFV1L3_2.f:110.26:
>
> COEFF(2,3,4)= COUP*-F1(5)
> 1
> Warning: Extension: Unary operator following arithmetic operator (use parentheses) at (1)
> MP_FFV1L3_2.f:111.26:
>
> COEFF(3,3,4)= COUP*-F1(8)
> 1
> Warning: Extension: Unary operator following arithmetic operator (use parentheses) at (1)
> MP_FFV1L3_2.f:112.26:
>
> COEFF(4,3,4)= COUP*-F1(7)
> 1
> Warning: Extension: Unary operator following arithmetic operator (use parentheses) at (1)
> gfortran -O -fno-automatic -ffixed-line-length-132 -c -o FFV4_1.o FFV4_1.f
> gfortran -O -fno-automatic -ffixed-line-length-132 -c -o MP_FFV4_1.o MP_FFV4_1.f
> gfortran -O -fno-automatic -ffixed-line-length-132 -c -o FFV1_1.o FFV1_1.f
> gfortran -O -fno-automatic -ffixed-line-length-132 -c -o MP_FFV1_1.o MP_FFV1_1.f
> gfortran -O -fno-automatic -ffixed-line-length-132 -c -o FFV1_3_4L2_1.o FFV1_3_4L2_1.f
> gfortran -O -fno-automatic -ffixed-line-length-132 -c -o MP_FFV1_3_4L2_1.o MP_FFV1_3_4L2_1.f
> gfortran -O -fno-automatic -ffixed-line-length-132 -c -o FFV1_3_4_0.o FFV1_3_4_0.f
> gfortran -O -fno-automatic -ffixed-line-length-132 -c -o MP_FFV1_3_4_0.o MP_FFV1_3_4_0.f
> gfortran -O -fno-automatic -ffixed-line-length-132 -c -o FFV4L2_1.o FFV4L2_1.f
> FFV4L2_1.f:28.26:
>
> COEFF(4,0,1)= COUP*-M1*(V3(7)+CI*(V3(6)))
> 1
> Warning: Extension: Unary operator following arithmetic operator (use parentheses) at (1)
> FFV4L2_1.f:50.26:
>
> COEFF(3,0,2)= COUP*-M1*(+CI*(V3(6))-V3(7))
> 1
> Warning: Extension: Unary operator following arithmetic operator (use parentheses) at (1)
> gfortran -O -fno-automatic -ffixed-line-length-132 -c -o MP_FFV4L2_1.o MP_FFV4L2_1.f
> MP_FFV4L2_1.f:28.26:
>
> COEFF(4,0,1)= COUP*-M1*(V3(7)+CI*(V3(6)))
> 1
> Warning: Extension: Unary operator following arithmetic operator (use parentheses) at (1)
> MP_FFV4L2_1.f:50.26:
>
> COEFF(3,0,2)= COUP*-M1*(+CI*(V3(6))-V3(7))
> 1
> Warning: Extension: Unary operator following arithmetic operator (use parentheses) at (1)
> gfortran -O -fno-automatic -ffixed-line-length-132 -c -o FFV1_0.o FFV1_0.f
> gfortran -O -fno-automatic -ffixed-line-length-132 -c -o MP_FFV1_0.o MP_FFV1_0.f
> gfortran -O -fno-automatic -ffixed-line-length-132 -c -o FFV1_3_4L3_2.o FFV1_3_4L3_2.f
> gfortran -O -fno-automatic -ffixed-line-length-132 -c -o MP_FFV1_3_4L3_2.o MP_FFV1_3_4L3_2.f
> gfortran -O -fno-automatic -ffixed-line-length-132 -c -o FFV1L2_1.o FFV1L2_1.f
> FFV1L2_1.f:28.26:
>
> COEFF(4,0,1)= COUP*-M1*(V3(7)+CI*(V3(6)))
> 1
> Warning: Extension: Unary operator following arithmetic operator (use parentheses) at (1)
> FFV1L2_1.f:50.26:
>
> COEFF(3,0,2)= COUP*-M1*(+CI*(V3(6))-V3(7))
> 1
> Warning: Extension: Unary operator following arithmetic operator (use parentheses) at (1)
> gfortran -O -fno-automatic -ffixed-line-length-132 -c -o MP_FFV1L2_1.o MP_FFV1L2_1.f
> MP_FFV1L2_1.f:28.26:
>
> COEFF(4,0,1)= COUP*-M1*(V3(7)+CI*(V3(6)))
> 1
> Warning: Extension: Unary operator following arithmetic operator (use parentheses) at (1)
> MP_FFV1L2_1.f:50.26:
>
> COEFF(3,0,2)= COUP*-M1*(+CI*(V3(6))-V3(7))
> 1
> Warning: Extension: Unary operator following arithmetic operator (use parentheses) at (1)
> gfortran -O -fno-automatic -ffixed-line-length-132 -c -o FFV4_2.o FFV4_2.f
> gfortran -O -fno-automatic -ffixed-line-length-132 -c -o MP_FFV4_2.o MP_FFV4_2.f
> gfortran -O -fno-automatic -ffixed-line-length-132 -c -o FFV4L1_2.o FFV4L1_2.f
> FFV4L1_2.f:62.26:
>
> COEFF(2,0,3)= COUP*-M2*(+CI*(V3(6))-V3(7))
> 1
> Warning: Extension: Unary operator following arithmetic operator (use parentheses) at (1)
> FFV4L1_2.f:84.26:
>
> COEFF(1,0,4)= COUP*-M2*(V3(7)+CI*(V3(6)))
> 1
> Warning: Extension: Unary operator following arithmetic operator (use parentheses) at (1)
> gfortran -O -fno-automatic -ffixed-line-length-132 -c -o MP_FFV4L1_2.o MP_FFV4L1_2.f
> MP_FFV4L1_2.f:62.26:
>
> COEFF(2,0,3)= COUP*-M2*(+CI*(V3(6))-V3(7))
> 1
> Warning: Extension: Unary operator following arithmetic operator (use parentheses) at (1)
> MP_FFV4L1_2.f:84.26:
>
> COEFF(1,0,4)= COUP*-M2*(V3(7)+CI*(V3(6)))
> 1
> Warning: Extension: Unary operator following arithmetic operator (use parentheses) at (1)
> gfortran -O -fno-automatic -ffixed-line-length-132 -c -o FF4_0.o FF4_0.f
> gfortran -O -fno-automatic -ffixed-line-length-132 -c -o MP_FF4_0.o MP_FF4_0.f
> gfortran -O -fno-automatic -ffixed-line-length-132 -c -o FFV1_3_4_1.o FFV1_3_4_1.f
> gfortran -O -fno-automatic -ffixed-line-length-132 -c -o MP_FFV1_3_4_1.o MP_FFV1_3_4_1.f
> gfortran -O -fno-automatic -ffixed-line-length-132 -c -o FFV1L1_2.o FFV1L1_2.f
> FFV1L1_2.f:69.26:
>
> COEFF(2,0,3)= COUP*-M2*(+CI*(V3(6))-V3(7))
> 1
> Warning: Extension: Unary operator following arithmetic operator (use parentheses) at (1)
> FFV1L1_2.f:91.26:
>
> COEFF(1,0,4)= COUP*-M2*(V3(7)+CI*(V3(6)))
> 1
> Warning: Extension: Unary operator following arithmetic operator (use parentheses) at (1)
> gfortran -O -fno-automatic -ffixed-line-length-132 -c -o MP_FFV1L1_2.o MP_FFV1L1_2.f
> MP_FFV1L1_2.f:69.26:
>
> COEFF(2,0,3)= COUP*-M2*(+CI*(V3(6))-V3(7))
> 1
> Warning: Extension: Unary operator following arithmetic operator (use parentheses) at (1)
> MP_FFV1L1_2.f:91.26:
>
> COEFF(1,0,4)= COUP*-M2*(V3(7)+CI*(V3(6)))
> 1
> Warning: Extension: Unary operator following arithmetic operator (use parentheses) at (1)
> gfortran -O -fno-automatic -ffixed-line-length-132 -c -o FFV1_3_4L1P0_3.o FFV1_3_4L1P0_3.f
> gfortran -O -fno-automatic -ffixed-line-length-132 -c -o MP_FFV1_3_4L1P0_3.o MP_FFV1_3_4L1P0_3.f
> gfortran -O -fno-automatic -ffixed-line-length-132 -c -o FFV4_3.o FFV4_3.f
> gfortran -O -fno-automatic -ffixed-line-length-132 -c -o MP_FFV4_3.o MP_FFV4_3.f
> gfortran -O -fno-automatic -ffixed-line-length-132 -c -o FFV1L3_1.o FFV1L3_1.f
> FFV1L3_1.f:35.26:
>
> COEFF(3,2,1)= COUP*-CI * F2(8)
> 1
> Warning: Extension: Unary operator following arithmetic operator (use parentheses) at (1)
> FFV1L3_1.f:36.26:
>
> COEFF(4,2,1)= COUP*-CI * F2(7)
> 1
> Warning: Extension: Unary operator following arithmetic operator (use parentheses) at (1)
> FFV1L3_1.f:37.26:
>
> COEFF(1,3,1)= COUP*-F2(6)
> 1
> Warning: Extension: Unary operator following arithmetic operator (use parentheses) at (1)
> FFV1L3_1.f:40.26:
>
> COEFF(4,3,1)= COUP*-F2(7)
> 1
> Warning: Extension: Unary operator following arithmetic operator (use parentheses) at (1)
> FFV1L3_1.f:42.26:
>
> COEFF(2,4,1)= COUP*-CI * F2(6)
> 1
> Warning: Extension: Unary operator following arithmetic operator (use parentheses) at (1)
> FFV1L3_1.f:43.26:
>
> COEFF(3,4,1)= COUP*-CI * F2(7)
> 1
> Warning: Extension: Unary operator following arithmetic operator (use parentheses) at (1)
> FFV1L3_1.f:53.26:
>
> COEFF(1,1,2)= COUP*-CI * F2(6)
> 1
> Warning: Extension: Unary operator following arithmetic operator (use parentheses) at (1)
> FFV1L3_1.f:54.26:
>
> COEFF(2,1,2)= COUP*-CI * F2(5)
> 1
> Warning: Extension: Unary operator following arithmetic operator (use parentheses) at (1)
> FFV1L3_1.f:57.26:
>
> COEFF(1,2,2)= COUP*-CI * F2(5)
> 1
> Warning: Extension: Unary operator following arithmetic operator (use parentheses) at (1)
> FFV1L3_1.f:58.26:
>
> COEFF(2,2,2)= COUP*-CI * F2(6)
> 1
> Warning: Extension: Unary operator following arithmetic operator (use parentheses) at (1)
> FFV1L3_1.f:59.26:
>
> COEFF(3,2,2)= COUP*-CI * F2(7)
> 1
> Warning: Extension: Unary operator following arithmetic operator (use parentheses) at (1)
> FFV1L3_1.f:60.26:
>
> COEFF(4,2,2)= COUP*-CI * F2(8)
> 1
> Warning: Extension: Unary operator following arithmetic operator (use parentheses) at (1)
> FFV1L3_1.f:62.26:
>
> COEFF(2,3,2)= COUP*-F2(6)
> 1
> Warning: Extension: Unary operator following arithmetic operator (use parentheses) at (1)
> FFV1L3_1.f:64.26:
>
> COEFF(4,3,2)= COUP*-F2(8)
> 1
> Warning: Extension: Unary operator following arithmetic operator (use parentheses) at (1)
> FFV1L3_1.f:65.26:
>
> COEFF(1,4,2)= COUP*-CI * F2(6)
> 1
> Warning: Extension: Unary operator following arithmetic operator (use parentheses) at (1)
> FFV1L3_1.f:67.26:
>
> COEFF(3,4,2)= COUP*-CI * F2(8)
> 1
> Warning: Extension: Unary operator following arithmetic operator (use parentheses) at (1)
> FFV1L3_1.f:78.26:
>
> COEFF(2,1,3)= COUP*-F2(5)
> 1
> Warning: Extension: Unary operator following arithmetic operator (use parentheses) at (1)
> FFV1L3_1.f:79.26:
>
> COEFF(3,1,3)= COUP*-F2(8)
> 1
> Warning: Extension: Unary operator following arithmetic operator (use parentheses) at (1)
> FFV1L3_1.f:81.26:
>
> COEFF(1,2,3)= COUP*-F2(5)
> 1
> Warning: Extension: Unary operator following arithmetic operator (use parentheses) at (1)
> FFV1L3_1.f:83.26:
>
> COEFF(3,2,3)= COUP*-F2(7)
> 1
> Warning: Extension: Unary operator following arithmetic operator (use parentheses) at (1)
> FFV1L3_1.f:85.26:
>
> COEFF(1,3,3)= COUP*-CI * F2(5)
> 1
> Warning: Extension: Unary operator following arithmetic operator (use parentheses) at (1)
> FFV1L3_1.f:86.26:
>
> COEFF(2,3,3)= COUP*-CI * F2(6)
> 1
> Warning: Extension: Unary operator following arithmetic operator (use parentheses) at (1)
> FFV1L3_1.f:87.26:
>
> COEFF(3,3,3)= COUP*-CI * F2(7)
> 1
> Warning: Extension: Unary operator following arithmetic operator (use parentheses) at (1)
> FFV1L3_1.f:88.26:
>
> COEFF(4,3,3)= COUP*-CI * F2(8)
> 1
> Warning: Extension: Unary operator following arithmetic operator (use parentheses) at (1)
> FFV1L3_1.f:101.26:
>
> COEFF(1,1,4)= COUP*-CI * F2(5)
> 1
> Warning: Extension: Unary operator following arithmetic operator (use parentheses) at (1)
> FFV1L3_1.f:104.26:
>
> COEFF(4,1,4)= COUP*-CI * F2(8)
> 1
> Warning: Extension: Unary operator following arithmetic operator (use parentheses) at (1)
> FFV1L3_1.f:106.26:
>
> COEFF(2,2,4)= COUP*-CI * F2(5)
> 1
> Warning: Extension: Unary operator following arithmetic operator (use parentheses) at (1)
> FFV1L3_1.f:108.26:
>
> COEFF(4,2,4)= COUP*-CI * F2(7)
> 1
> Warning: Extension: Unary operator following arithmetic operator (use parentheses) at (1)
> FFV1L3_1.f:109.26:
>
> COEFF(1,3,4)= COUP*-F2(6)
> 1
> Warning: Extension: Unary operator following arithmetic operator (use parentheses) at (1)
> FFV1L3_1.f:110.26:
>
> COEFF(2,3,4)= COUP*-F2(5)
> 1
> Warning: Extension: Unary operator following arithmetic operator (use parentheses) at (1)
> FFV1L3_1.f:111.26:
>
> COEFF(3,3,4)= COUP*-F2(8)
> 1
> Warning: Extension: Unary operator following arithmetic operator (use parentheses) at (1)
> FFV1L3_1.f:112.26:
>
> COEFF(4,3,4)= COUP*-F2(7)
> 1
> Warning: Extension: Unary operator following arithmetic operator (use parentheses) at (1)
> FFV1L3_1.f:113.26:
>
> COEFF(1,4,4)= COUP*-CI * F2(5)
> 1
> Warning: Extension: Unary operator following arithmetic operator (use parentheses) at (1)
> FFV1L3_1.f:114.26:
>
> COEFF(2,4,4)= COUP*-CI * F2(6)
> 1
> Warning: Extension: Unary operator following arithmetic operator (use parentheses) at (1)
> FFV1L3_1.f:115.26:
>
> COEFF(3,4,4)= COUP*-CI * F2(7)
> 1
> Warning: Extension: Unary operator following arithmetic operator (use parentheses) at (1)
> FFV1L3_1.f:116.26:
>
> COEFF(4,4,4)= COUP*-CI * F2(8)
> 1
> Warning: Extension: Unary operator following arithmetic operator (use parentheses) at (1)
> gfortran -O -fno-automatic -ffixed-line-length-132 -c -o MP_FFV1L3_1.o MP_FFV1L3_1.f
> MP_FFV1L3_1.f:35.26:
>
> COEFF(3,2,1)= COUP*-CI * F2(8)
> 1
> Warning: Extension: Unary operator following arithmetic operator (use parentheses) at (1)
> MP_FFV1L3_1.f:36.26:
>
> COEFF(4,2,1)= COUP*-CI * F2(7)
> 1
> Warning: Extension: Unary operator following arithmetic operator (use parentheses) at (1)
> MP_FFV1L3_1.f:37.26:
>
> COEFF(1,3,1)= COUP*-F2(6)
> 1
> Warning: Extension: Unary operator following arithmetic operator (use parentheses) at (1)
> MP_FFV1L3_1.f:40.26:
>
> COEFF(4,3,1)= COUP*-F2(7)
> 1
> Warning: Extension: Unary operator following arithmetic operator (use parentheses) at (1)
> MP_FFV1L3_1.f:42.26:
>
> COEFF(2,4,1)= COUP*-CI * F2(6)
> 1
> Warning: Extension: Unary operator following arithmetic operator (use parentheses) at (1)
> MP_FFV1L3_1.f:43.26:
>
> COEFF(3,4,1)= COUP*-CI * F2(7)
> 1
> Warning: Extension: Unary operator following arithmetic operator (use parentheses) at (1)
> MP_FFV1L3_1.f:53.26:
>
> COEFF(1,1,2)= COUP*-CI * F2(6)
> 1
> Warning: Extension: Unary operator following arithmetic operator (use parentheses) at (1)
> MP_FFV1L3_1.f:54.26:
>
> COEFF(2,1,2)= COUP*-CI * F2(5)
> 1
> Warning: Extension: Unary operator following arithmetic operator (use parentheses) at (1)
> MP_FFV1L3_1.f:57.26:
>
> COEFF(1,2,2)= COUP*-CI * F2(5)
> 1
> Warning: Extension: Unary operator following arithmetic operator (use parentheses) at (1)
> MP_FFV1L3_1.f:58.26:
>
> COEFF(2,2,2)= COUP*-CI * F2(6)
> 1
> Warning: Extension: Unary operator following arithmetic operator (use parentheses) at (1)
> MP_FFV1L3_1.f:59.26:
>
> COEFF(3,2,2)= COUP*-CI * F2(7)
> 1
> Warning: Extension: Unary operator following arithmetic operator (use parentheses) at (1)
> MP_FFV1L3_1.f:60.26:
>
> COEFF(4,2,2)= COUP*-CI * F2(8)
> 1
> Warning: Extension: Unary operator following arithmetic operator (use parentheses) at (1)
> MP_FFV1L3_1.f:62.26:
>
> COEFF(2,3,2)= COUP*-F2(6)
> 1
> Warning: Extension: Unary operator following arithmetic operator (use parentheses) at (1)
> MP_FFV1L3_1.f:64.26:
>
> COEFF(4,3,2)= COUP*-F2(8)
> 1
> Warning: Extension: Unary operator following arithmetic operator (use parentheses) at (1)
> MP_FFV1L3_1.f:65.26:
>
> COEFF(1,4,2)= COUP*-CI * F2(6)
> 1
> Warning: Extension: Unary operator following arithmetic operator (use parentheses) at (1)
> MP_FFV1L3_1.f:67.26:
>
> COEFF(3,4,2)= COUP*-CI * F2(8)
> 1
> Warning: Extension: Unary operator following arithmetic operator (use parentheses) at (1)
> MP_FFV1L3_1.f:78.26:
>
> COEFF(2,1,3)= COUP*-F2(5)
> 1
> Warning: Extension: Unary operator following arithmetic operator (use parentheses) at (1)
> MP_FFV1L3_1.f:79.26:
>
> COEFF(3,1,3)= COUP*-F2(8)
> 1
> Warning: Extension: Unary operator following arithmetic operator (use parentheses) at (1)
> MP_FFV1L3_1.f:81.26:
>
> COEFF(1,2,3)= COUP*-F2(5)
> 1
> Warning: Extension: Unary operator following arithmetic operator (use parentheses) at (1)
> MP_FFV1L3_1.f:83.26:
>
> COEFF(3,2,3)= COUP*-F2(7)
> 1
> Warning: Extension: Unary operator following arithmetic operator (use parentheses) at (1)
> MP_FFV1L3_1.f:85.26:
>
> COEFF(1,3,3)= COUP*-CI * F2(5)
> 1
> Warning: Extension: Unary operator following arithmetic operator (use parentheses) at (1)
> MP_FFV1L3_1.f:86.26:
>
> COEFF(2,3,3)= COUP*-CI * F2(6)
> 1
> Warning: Extension: Unary operator following arithmetic operator (use parentheses) at (1)
> MP_FFV1L3_1.f:87.26:
>
> COEFF(3,3,3)= COUP*-CI * F2(7)
> 1
> Warning: Extension: Unary operator following arithmetic operator (use parentheses) at (1)
> MP_FFV1L3_1.f:88.26:
>
> COEFF(4,3,3)= COUP*-CI * F2(8)
> 1
> Warning: Extension: Unary operator following arithmetic operator (use parentheses) at (1)
> MP_FFV1L3_1.f:101.26:
>
> COEFF(1,1,4)= COUP*-CI * F2(5)
> 1
> Warning: Extension: Unary operator following arithmetic operator (use parentheses) at (1)
> MP_FFV1L3_1.f:104.26:
>
> COEFF(4,1,4)= COUP*-CI * F2(8)
> 1
> Warning: Extension: Unary operator following arithmetic operator (use parentheses) at (1)
> MP_FFV1L3_1.f:106.26:
>
> COEFF(2,2,4)= COUP*-CI * F2(5)
> 1
> Warning: Extension: Unary operator following arithmetic operator (use parentheses) at (1)
> MP_FFV1L3_1.f:108.26:
>
> COEFF(4,2,4)= COUP*-CI * F2(7)
> 1
> Warning: Extension: Unary operator following arithmetic operator (use parentheses) at (1)
> MP_FFV1L3_1.f:109.26:
>
> COEFF(1,3,4)= COUP*-F2(6)
> 1
> Warning: Extension: Unary operator following arithmetic operator (use parentheses) at (1)
> MP_FFV1L3_1.f:110.26:
>
> COEFF(2,3,4)= COUP*-F2(5)
> 1
> Warning: Extension: Unary operator following arithmetic operator (use parentheses) at (1)
> MP_FFV1L3_1.f:111.26:
>
> COEFF(3,3,4)= COUP*-F2(8)
> 1
> Warning: Extension: Unary operator following arithmetic operator (use parentheses) at (1)
> MP_FFV1L3_1.f:112.26:
>
> COEFF(4,3,4)= COUP*-F2(7)
> 1
> Warning: Extension: Unary operator following arithmetic operator (use parentheses) at (1)
> MP_FFV1L3_1.f:113.26:
>
> COEFF(1,4,4)= COUP*-CI * F2(5)
> 1
> Warning: Extension: Unary operator following arithmetic operator (use parentheses) at (1)
> MP_FFV1L3_1.f:114.26:
>
> COEFF(2,4,4)= COUP*-CI * F2(6)
> 1
> Warning: Extension: Unary operator following arithmetic operator (use parentheses) at (1)
> MP_FFV1L3_1.f:115.26:
>
> COEFF(3,4,4)= COUP*-CI * F2(7)
> 1
> Warning: Extension: Unary operator following arithmetic operator (use parentheses) at (1)
> MP_FFV1L3_1.f:116.26:
>
> COEFF(4,4,4)= COUP*-CI * F2(8)
> 1
> Warning: Extension: Unary operator following arithmetic operator (use parentheses) at (1)
> gfortran -O -fno-automatic -ffixed-line-length-132 -c -o FFV1_3_4L3_1.o FFV1_3_4L3_1.f
> gfortran -O -fno-automatic -ffixed-line-length-132 -c -o MP_FFV1_3_4L3_1.o MP_FFV1_3_4L3_1.f
> ar cru ../../lib/libdhelas.a aloha_functions.o FFV1_3_4_2.o MP_FFV1_3_4_2.o FFV4_0.o MP_FFV4_0.o FFV1_2.o MP_FFV1_2.o FFV1_3_4L2P0_3.o MP_FFV1_3_4L2P0_3.o FFV1L2P0_3.o MP_FFV1L2P0_3.o FF1_0.o MP_FF1_0.o FFV1_3_4L1_2.o MP_FFV1_3_4L1_2.o FFV1L1P0_3.o MP_FFV1L1P0_3.o FFV3_0.o MP_FFV3_0.o FFV1L3_2.o MP_FFV1L3_2.o FFV4_1.o MP_FFV4_1.o FFV1_1.o MP_FFV1_1.o FFV1_3_4L2_1.o MP_FFV1_3_4L2_1.o FFV1_3_4_0.o MP_FFV1_3_4_0.o FFV4L2_1.o MP_FFV4L2_1.o FFV1_0.o MP_FFV1_0.o FFV1_3_4L3_2.o MP_FFV1_3_4L3_2.o FFV1L2_1.o MP_FFV1L2_1.o FFV4_2.o MP_FFV4_2.o FFV4L1_2.o MP_FFV4L1_2.o FF4_0.o MP_FF4_0.o FFV1_3_4_1.o MP_FFV1_3_4_1.o FFV1L1_2.o MP_FFV1L1_2.o FFV1_3_4L1P0_3.o MP_FFV1_3_4L1P0_3.o FFV4_3.o MP_FFV4_3.o FFV1L3_1.o MP_FFV1L3_1.o FFV1_3_4L3_1.o MP_FFV1_3_4L3_1.o
> ranlib ../../lib/libdhelas.a
> make[1]: Leaving directory `/data9/Users/shjeon/gridpack_MG5_aMC_v2_6_0_copy1/MG5_aMC_v2_6_0/WRToNLep_MuMuJJ_WR400_N100_Tchannel_NLO/Source/DHELAS'
> gfortran -O -fno-automatic -ffixed-line-length-132 -c alfas_functions_lhapdf.f
> gfortran -O -fno-automatic -ffixed-line-length-132 -c rw_routines.f
> gfortran -O -fno-automatic -ffixed-line-length-132 -c kin_functions.f
> run.inc:74.21:
> Included at kin_functions.f:111:
>
> common/to_rwgt/ do_rwgt_scale, rw_Fscale_down, rw_Fscale_up, rw_Rscale_do
> 1
> Warning: Padding of 4 bytes required before 'rw_fscale_down' in COMMON 'to_rwgt' at (1); reorder elements or use -fno-align-commons
> run.inc:74.21:
> Included at kin_functions.f:136:
>
> common/to_rwgt/ do_rwgt_scale, rw_Fscale_down, rw_Fscale_up, rw_Rscale_do
> 1
> Warning: Padding of 4 bytes required before 'rw_fscale_down' in COMMON 'to_rwgt' at (1); reorder elements or use -fno-align-commons
> run.inc:74.21:
> Included at kin_functions.f:232:
>
> common/to_rwgt/ do_rwgt_scale, rw_Fscale_down, rw_Fscale_up, rw_Rscale_do
> 1
> Warning: Padding of 4 bytes required before 'rw_fscale_down' in COMMON 'to_rwgt' at (1); reorder elements or use -fno-align-commons
> run.inc:74.21:
> Included at kin_functions.f:327:
>
> common/to_rwgt/ do_rwgt_scale, rw_Fscale_down, rw_Fscale_up, rw_Rscale_do
> 1
> Warning: Padding of 4 bytes required before 'rw_fscale_down' in COMMON 'to_rwgt' at (1); reorder elements or use -fno-align-commons
> run.inc:74.21:
> Included at kin_functions.f:376:
>
> common/to_rwgt/ do_rwgt_scale, rw_Fscale_down, rw_Fscale_up, rw_Rscale_do
> 1
> Warning: Padding of 4 bytes required before 'rw_fscale_down' in COMMON 'to_rwgt' at (1); reorder elements or use -fno-align-commons
> gfortran -O -fno-automatic -ffixed-line-length-132 -c run_printout.f
> run.inc:74.21:
> Included at run_printout.f:15:
>
> common/to_rwgt/ do_rwgt_scale, rw_Fscale_down, rw_Fscale_up, rw_Rscale_do
> 1
> Warning: Padding of 4 bytes required before 'rw_fscale_down' in COMMON 'to_rwgt' at (1); reorder elements or use -fno-align-commons
> gfortran -O -fno-automatic -ffixed-line-length-132 -c dgauss.f
> gfortran -O -fno-automatic -ffixed-line-length-132 -c ranmar.f
> gfortran -O -fno-automatic -ffixed-line-length-132 -c extra_weights.f
> gfortran -O -fno-automatic -ffixed-line-length-132 -c -o setrun.o setrun.f
> run.inc:74.21:
> Included at setrun.f:12:
>
> common/to_rwgt/ do_rwgt_scale, rw_Fscale_down, rw_Fscale_up, rw_Rscale_do
> 1
> Warning: Padding of 4 bytes required before 'rw_fscale_down' in COMMON 'to_rwgt' at (1); reorder elements or use -fno-align-commons
> rm -f ../lib/libgeneric.a
> ar cru libgeneric.a alfas_functions_lhapdf.o rw_routines.o kin_functions.o run_printout.o dgauss.o ranmar.o setrun.o extra_weights.o
> ranlib libgeneric.a
> mv libgeneric.a ../lib/
> cp -f extra_weights.mod ../lib/
> rm -f alfas_functions_lhapdf.o
> rm -f ../lib/libpdf.a
> cd PDF; make
> make[1]: Entering directory `/data9/Users/shjeon/gridpack_MG5_aMC_v2_6_0_copy1/MG5_aMC_v2_6_0/WRToNLep_MuMuJJ_WR400_N100_Tchannel_NLO/Source/PDF'
> gfortran -O -fno-automatic -ffixed-line-length-132 -c -o pdfwrap_lhapdf.o pdfwrap_lhapdf.f
> g++ -O -O3 -I/cvmfs/cms.cern.ch/slc6_amd64_gcc481/external/lhapdf/6.2.1-ddibom/include -c -o pdf_lhapdf6.o pdf_lhapdf6.cc
> pdf_lhapdf6.cc:44:11: error: 'boost' does not name a type
> typedef boost::shared_ptr<LHAPDF::PDF> PDFPtr;
> ^
> pdf_lhapdf6.cc:102:11: error: 'PDFPtr' does not name a type
> const PDFPtr member(int mem) {
> ^
> pdf_lhapdf6.cc:111:11: error: 'PDFPtr' does not name a type
> const PDFPtr activemember() {
> ^
> pdf_lhapdf6.cc:126:14: error: 'PDFPtr' was not declared in this scope
> map<int, PDFPtr> members;
> ^
> pdf_lhapdf6.cc:126:20: error: template argument 2 is invalid
> map<int, PDFPtr> members;
> ^
> pdf_lhapdf6.cc:126:20: error: template argument 4 is invalid
> pdf_lhapdf6.cc: In member function 'void lhapdf_amc::PDFSetHandler::loadMember(int)':
> pdf_lhapdf6.cc:86:19: error: request for member 'find' in '((lhapdf_amc::PDFSetHandler*)this)->lhapdf_amc::PDFSetHandler::members', which is of non-class type 'int'
> if (members.find(mem) == members.end())
> ^
> pdf_lhapdf6.cc:86:40: error: request for member 'end' in '((lhapdf_amc::PDFSetHandler*)this)->lhapdf_amc::PDFSetHandler::members', which is of non-class type 'int'
> if (members.find(mem) == members.end())
> ^
> pdf_lhapdf6.cc:87:20: error: invalid types 'int[int]' for array subscript
> members[mem] = PDFPtr(LHAPDF::mkPDF(setname, mem));
> ^
> pdf_lhapdf6.cc:87:58: error: 'PDFPtr' was not declared in this scope
> members[mem] = PDFPtr(LHAPDF::mkPDF(setname, mem));
> ^
> pdf_lhapdf6.cc: In member function 'void lhapdf_amc::PDFSetHandler::unloadMember(int)':
> pdf_lhapdf6.cc:93:15: error: request for member 'erase' in '((lhapdf_amc::PDFSetHandler*)this)->lhapdf_amc::PDFSetHandler::members', which is of non-class type 'int'
> members.erase(mem);
> ^
> pdf_lhapdf6.cc:94:37: error: request for member 'empty' in '((lhapdf_amc::PDFSetHandler*)this)->lhapdf_amc::PDFSetHandler::members', which is of non-class type 'int'
> const int nextmem = (!members.empty()) ? members.begin()->first : 0;
> ^
> pdf_lhapdf6.cc:94:56: error: request for member 'begin' in '((lhapdf_amc::PDFSetHandler*)this)->lhapdf_amc::PDFSetHandler::members', which is of non-class type 'int'
> const int nextmem = (!members.empty()) ? members.begin()->first : 0;
> ^
> pdf_lhapdf6.cc: In function 'std::string lhaglue_get_current_pdf(int)':
> pdf_lhapdf6.cc:144:39: error: 'std::map<int, lhapdf_amc::PDFSetHandler>::mapped_type' has no member named 'activemember'
> return lhapdf_amc::ACTIVESETS[nset].activemember()->set().name() + " (" +
> ^
> pdf_lhapdf6.cc:145:49: error: 'std::map<int, lhapdf_amc::PDFSetHandler>::mapped_type' has no member named 'activemember'
> LHAPDF::to_str(lhapdf_amc::ACTIVESETS[nset].activemember()->lhapdfID()) + ")";
> ^
> pdf_lhapdf6.cc: In function 'void lhapdf_getversion_(char*, size_t)':
> pdf_lhapdf6.cc:156:35: error: 'strncpy' was not declared in this scope
> strncpy(s, LHAPDF_VERSION, len);
> ^
> pdf_lhapdf6.cc: In function 'void lhapdf_getpdfsetlist_(char*, size_t)':
> pdf_lhapdf6.cc:162:19: error: expected primary-expression before 'const'
> BOOST_FOREACH(const string& setname, LHAPDF::availablePDFSets()) {
> ^
> pdf_lhapdf6.cc:162:68: error: 'BOOST_FOREACH' was not declared in this scope
> BOOST_FOREACH(const string& setname, LHAPDF::availablePDFSets()) {
> ^
> pdf_lhapdf6.cc:162:70: error: expected ';' before '{' token
> BOOST_FOREACH(const string& setname, LHAPDF::availablePDFSets()) {
> ^
> pdf_lhapdf6.cc:166:36: error: 'strncpy' was not declared in this scope
> strncpy(s, liststr.c_str(), len);
> ^
> pdf_lhapdf6.cc: In function 'void getlhapdfversion_(char*, size_t)':
> pdf_lhapdf6.cc:180:35: error: 'strncpy' was not declared in this scope
> strncpy(s, LHAPDF_VERSION, len);
> ^
> pdf_lhapdf6.cc: In function 'void setpdfpath_(const char*, size_t)':
> pdf_lhapdf6.cc:205:23: error: 'strncpy' was not declared in this scope
> strncpy(s2, s, len);
> ^
> pdf_lhapdf6.cc: In function 'void getdatapath_(char*, size_t)':
> pdf_lhapdf6.cc:213:19: error: expected primary-expression before 'const'
> BOOST_FOREACH(const string& path, LHAPDF::paths()) {
> ^
> pdf_lhapdf6.cc:213:54: error: 'BOOST_FOREACH' was not declared in this scope
> BOOST_FOREACH(const string& path, LHAPDF::paths()) {
> ^
> pdf_lhapdf6.cc:213:56: error: expected ';' before '{' token
> BOOST_FOREACH(const string& path, LHAPDF::paths()) {
> ^
> pdf_lhapdf6.cc:217:36: error: 'strncpy' was not declared in this scope
> strncpy(s, pathstr.c_str(), len);
> ^
> pdf_lhapdf6.cc: In function 'void initpdfsetm_(const int&, const char*, int)':
> pdf_lhapdf6.cc:239:9: error: 'boost' has not been declared
> if (boost::algorithm::to_lower_copy(path) == "cteq6ll") path = "cteq6l1";
> ^
> pdf_lhapdf6.cc: In function 'void initpdfsetbynamem_(const int&, const char*, int)':
> pdf_lhapdf6.cc:262:9: error: 'boost' has not been declared
> if (boost::algorithm::to_lower_copy(name) == "cteq6ll") name = "cteq6l1";
> ^
> pdf_lhapdf6.cc: In function 'void evolvepdfm_(const int&, const double&, const double&, double*)':
> pdf_lhapdf6.cc:336:47: error: 'std::map<int, lhapdf_amc::PDFSetHandler>::mapped_type' has no member named 'activemember'
> fxq[i] = lhapdf_amc::ACTIVESETS[nset].activemember()->xfxQ(i-6, x, q);
> ^
> pdf_lhapdf6.cc: In function 'void evolvepartm_(const int&, const int&, const double&, const double&, double&)':
> pdf_lhapdf6.cc:361:42: error: 'std::map<int, lhapdf_amc::PDFSetHandler>::mapped_type' has no member named 'activemember'
> fxq = lhapdf_amc::ACTIVESETS[nset].activemember()->xfxQ(ipart_copy, x, q);
> ^
> pdf_lhapdf6.cc: In function 'bool has_photon_()':
> pdf_lhapdf6.cc:379:59: error: 'std::map<int, lhapdf_amc::PDFSetHandler>::mapped_type' has no member named 'activemember'
> return lhapdf_amc::ACTIVESETS[lhapdf_amc::CURRENTSET].activemember()->hasFlavor(22);
> ^
> pdf_lhapdf6.cc: In function 'void evolvepdfphotonm_(const int&, const double&, const double&, double*, double&)':
> pdf_lhapdf6.cc:391:48: error: 'std::map<int, lhapdf_amc::PDFSetHandler>::mapped_type' has no member named 'activemember'
> photonfxq = lhapdf_amc::ACTIVESETS[nset].activemember()->xfxQ(22, x, q);
> ^
> pdf_lhapdf6.cc: In function 'void getorderasm_(const int&, int&)':
> pdf_lhapdf6.cc:425:40: error: 'std::map<int, lhapdf_amc::PDFSetHandler>::mapped_type' has no member named 'activemember'
> oas = lhapdf_amc::ACTIVESETS[nset].activemember()->info().get_entry_as<int>("AlphaS_OrderQCD");
> ^
> pdf_lhapdf6.cc:425:76: error: expected primary-expression before 'int'
> oas = lhapdf_amc::ACTIVESETS[nset].activemember()->info().get_entry_as<int>("AlphaS_OrderQCD");
> ^
> pdf_lhapdf6.cc:425:76: error: expected ';' before 'int'
> pdf_lhapdf6.cc: In function 'double alphaspdfm_(const int&, const double&)':
> pdf_lhapdf6.cc:440:41: error: 'std::map<int, lhapdf_amc::PDFSetHandler>::mapped_type' has no member named 'activemember'
> return lhapdf_amc::ACTIVESETS[nset].activemember()->alphasQ(Q);
> ^
> pdf_lhapdf6.cc: In function 'void numberpdfm_(const int&, int&)':
> pdf_lhapdf6.cc:458:43: error: 'std::map<int, lhapdf_amc::PDFSetHandler>::mapped_type' has no member named 'activemember'
> numpdf= lhapdf_amc::ACTIVESETS[nset].activemember()->info().get_entry_as<int>("NumMembers");
> ^
> pdf_lhapdf6.cc:458:79: error: expected primary-expression before 'int'
> numpdf= lhapdf_amc::ACTIVESETS[nset].activemember()->info().get_entry_as<int>("NumMembers");
> ^
> pdf_lhapdf6.cc:458:79: error: expected ';' before 'int'
> pdf_lhapdf6.cc: In function 'void getnfm_(const int&, int&)':
> pdf_lhapdf6.cc:474:39: error: 'std::map<int, lhapdf_amc::PDFSetHandler>::mapped_type' has no member named 'activemember'
> nf = lhapdf_amc::ACTIVESETS[nset].activemember()->info().get_entry_as<int>("NumFlavors");
> ^
> pdf_lhapdf6.cc:474:75: error: expected primary-expression before 'int'
> nf = lhapdf_amc::ACTIVESETS[nset].activemember()->info().get_entry_as<int>("NumFlavors");
> ^
> pdf_lhapdf6.cc:474:75: error: expected ';' before 'int'
> pdf_lhapdf6.cc: In function 'void getqmassm_(const int&, const int&, double&)':
> pdf_lhapdf6.cc:489:63: error: 'std::map<int, lhapdf_amc::PDFSetHandler>::mapped_type' has no member named 'activemember'
> if (nf*nf == 1) mass = lhapdf_amc::ACTIVESETS[nset].activemember()->info().get_entry_as<double>("MDown");
> ^
> pdf_lhapdf6.cc:489:99: error: expected primary-expression before 'double'
> if (nf*nf == 1) mass = lhapdf_amc::ACTIVESETS[nset].activemember()->info().get_entry_as<double>("MDown");
> ^
> pdf_lhapdf6.cc:489:99: error: expected ';' before 'double'
> pdf_lhapdf6.cc:490:63: error: 'std::map<int, lhapdf_amc::PDFSetHandler>::mapped_type' has no member named 'activemember'
> else if (nf*nf == 4) mass = lhapdf_amc::ACTIVESETS[nset].activemember()->info().get_entry_as<double>("MUp");
> ^
> pdf_lhapdf6.cc:490:99: error: expected primary-expression before 'double'
> else if (nf*nf == 4) mass = lhapdf_amc::ACTIVESETS[nset].activemember()->info().get_entry_as<double>("MUp");
> ^
> pdf_lhapdf6.cc:490:99: error: expected ';' before 'double'
> pdf_lhapdf6.cc:491:63: error: 'std::map<int, lhapdf_amc::PDFSetHandler>::mapped_type' has no member named 'activemember'
> else if (nf*nf == 9) mass = lhapdf_amc::ACTIVESETS[nset].activemember()->info().get_entry_as<double>("MStrange");
> ^
> pdf_lhapdf6.cc:491:99: error: expected primary-expression before 'double'
> else if (nf*nf == 9) mass = lhapdf_amc::ACTIVESETS[nset].activemember()->info().get_entry_as<double>("MStrange");
> ^
> pdf_lhapdf6.cc:491:99: error: expected ';' before 'double'
> pdf_lhapdf6.cc:492:63: error: 'std::map<int, lhapdf_amc::PDFSetHandler>::mapped_type' has no member named 'activemember'
> else if (nf*nf == 16) mass = lhapdf_amc::ACTIVESETS[nset].activemember()->info().get_entry_as<double>("MCharm");
> ^
> pdf_lhapdf6.cc:492:99: error: expected primary-expression before 'double'
> else if (nf*nf == 16) mass = lhapdf_amc::ACTIVESETS[nset].activemember()->info().get_entry_as<double>("MCharm");
> ^
> pdf_lhapdf6.cc:492:99: error: expected ';' before 'double'
> pdf_lhapdf6.cc:493:63: error: 'std::map<int, lhapdf_amc::PDFSetHandler>::mapped_type' has no member named 'activemember'
> else if (nf*nf == 25) mass = lhapdf_amc::ACTIVESETS[nset].activemember()->info().get_entry_as<double>("MBottom");
> ^
> pdf_lhapdf6.cc:493:99: error: expected primary-expression before 'double'
> else if (nf*nf == 25) mass = lhapdf_amc::ACTIVESETS[nset].activemember()->info().get_entry_as<double>("MBottom");
> ^
> pdf_lhapdf6.cc:493:99: error: expected ';' before 'double'
> pdf_lhapdf6.cc:494:63: error: 'std::map<int, lhapdf_amc::PDFSetHandler>::mapped_type' has no member named 'activemember'
> else if (nf*nf == 36) mass = lhapdf_amc::ACTIVESETS[nset].activemember()->info().get_entry_as<double>("MTop");
> ^
> pdf_lhapdf6.cc:494:99: error: expected primary-expression before 'double'
> else if (nf*nf == 36) mass = lhapdf_amc::ACTIVESETS[nset].activemember()->info().get_entry_as<double>("MTop");
> ^
> pdf_lhapdf6.cc:494:99: error: expected ';' before 'double'
> pdf_lhapdf6.cc: In function 'void getthresholdm_(const int&, const int&, double&)':
> pdf_lhapdf6.cc:511:62: error: 'std::map<int, lhapdf_amc::PDFSetHandler>::mapped_type' has no member named 'activemember'
> if (nf*nf == 1) Q = lhapdf_amc::ACTIVESETS[nset].activemember()->info().get_entry_as<double>("ThresholdDown");
> ^
> pdf_lhapdf6.cc:511:98: error: expected primary-expression before 'double'
> if (nf*nf == 1) Q = lhapdf_amc::ACTIVESETS[nset].activemember()->info().get_entry_as<double>("ThresholdDown");
> ^
> pdf_lhapdf6.cc:511:98: error: expected ';' before 'double'
> pdf_lhapdf6.cc:512:62: error: 'std::map<int, lhapdf_amc::PDFSetHandler>::mapped_type' has no member named 'activemember'
> else if (nf*nf == 4) Q = lhapdf_amc::ACTIVESETS[nset].activemember()->info().get_entry_as<double>("ThresholdUp");
> ^
> pdf_lhapdf6.cc:512:98: error: expected primary-expression before 'double'
> else if (nf*nf == 4) Q = lhapdf_amc::ACTIVESETS[nset].activemember()->info().get_entry_as<double>("ThresholdUp");
> ^
> pdf_lhapdf6.cc:512:98: error: expected ';' before 'double'
> pdf_lhapdf6.cc:513:62: error: 'std::map<int, lhapdf_amc::PDFSetHandler>::mapped_type' has no member named 'activemember'
> else if (nf*nf == 9) Q = lhapdf_amc::ACTIVESETS[nset].activemember()->info().get_entry_as<double>("ThresholdStrange");
> ^
> pdf_lhapdf6.cc:513:98: error: expected primary-expression before 'double'
> else if (nf*nf == 9) Q = lhapdf_amc::ACTIVESETS[nset].activemember()->info().get_entry_as<double>("ThresholdStrange");
> ^
> pdf_lhapdf6.cc:513:98: error: expected ';' before 'double'
> pdf_lhapdf6.cc:514:62: error: 'std::map<int, lhapdf_amc::PDFSetHandler>::mapped_type' has no member named 'activemember'
> else if (nf*nf == 16) Q = lhapdf_amc::ACTIVESETS[nset].activemember()->info().get_entry_as<double>("ThresholdCharm");
> ^
> pdf_lhapdf6.cc:514:98: error: expected primary-expression before 'double'
> else if (nf*nf == 16) Q = lhapdf_amc::ACTIVESETS[nset].activemember()->info().get_entry_as<double>("ThresholdCharm");
> ^
> pdf_lhapdf6.cc:514:98: error: expected ';' before 'double'
> pdf_lhapdf6.cc:515:62: error: 'std::map<int, lhapdf_amc::PDFSetHandler>::mapped_type' has no member named 'activemember'
> else if (nf*nf == 25) Q = lhapdf_amc::ACTIVESETS[nset].activemember()->info().get_entry_as<double>("ThresholdBottom");
> ^
> pdf_lhapdf6.cc:515:98: error: expected primary-expression before 'double'
> else if (nf*nf == 25) Q = lhapdf_amc::ACTIVESETS[nset].activemember()->info().get_entry_as<double>("ThresholdBottom");
> ^
> pdf_lhapdf6.cc:515:98: error: expected ';' before 'double'
> pdf_lhapdf6.cc:516:62: error: 'std::map<int, lhapdf_amc::PDFSetHandler>::mapped_type' has no member named 'activemember'
> else if (nf*nf == 36) Q = lhapdf_amc::ACTIVESETS[nset].activemember()->info().get_entry_as<double>("ThresholdTop");
> ^
> pdf_lhapdf6.cc:516:98: error: expected primary-expression before 'double'
> else if (nf*nf == 36) Q = lhapdf_amc::ACTIVESETS[nset].activemember()->info().get_entry_as<double>("ThresholdTop");
> ^
> pdf_lhapdf6.cc:516:98: error: expected ';' before 'double'
> pdf_lhapdf6.cc: In function 'void getdescm_(const int&)':
> pdf_lhapdf6.cc:535:42: error: 'std::map<int, lhapdf_amc::PDFSetHandler>::mapped_type' has no member named 'activemember'
> cout << lhapdf_amc::ACTIVESETS[nset].activemember()->description() << endl;
> ^
> pdf_lhapdf6.cc: In function 'void getxminm_(const int&, const int&, double&)':
> pdf_lhapdf6.cc:550:41: error: 'std::map<int, lhapdf_amc::PDFSetHandler>::mapped_type' has no member named 'activemember'
> xmin = lhapdf_amc::ACTIVESETS[nset].activemember()->info().get_entry_as<double>("XMin");
> ^
> pdf_lhapdf6.cc:550:77: error: expected primary-expression before 'double'
> xmin = lhapdf_amc::ACTIVESETS[nset].activemember()->info().get_entry_as<double>("XMin");
> ^
> pdf_lhapdf6.cc:550:77: error: expected ';' before 'double'
> pdf_lhapdf6.cc: In function 'void getxmaxm_(const int&, const int&, double&)':
> pdf_lhapdf6.cc:566:41: error: 'std::map<int, lhapdf_amc::PDFSetHandler>::mapped_type' has no member named 'activemember'
> xmax = lhapdf_amc::ACTIVESETS[nset].activemember()->info().get_entry_as<double>("XMax");
> ^
> pdf_lhapdf6.cc:566:77: error: expected primary-expression before 'double'
> xmax = lhapdf_amc::ACTIVESETS[nset].activemember()->info().get_entry_as<double>("XMax");
> ^
> pdf_lhapdf6.cc:566:77: error: expected ';' before 'double'
> pdf_lhapdf6.cc: In function 'void getq2minm_(const int&, const int&, double&)':
> pdf_lhapdf6.cc:582:54: error: 'std::map<int, lhapdf_amc::PDFSetHandler>::mapped_type' has no member named 'activemember'
> q2min = LHAPDF::sqr(lhapdf_amc::ACTIVESETS[nset].activemember()->info().get_entry_as<double>("QMin"));
> ^
> pdf_lhapdf6.cc:582:90: error: expected primary-expression before 'double'
> q2min = LHAPDF::sqr(lhapdf_amc::ACTIVESETS[nset].activemember()->info().get_entry_as<double>("QMin"));
> ^
> pdf_lhapdf6.cc: In function 'void getq2maxm_(const int&, const int&, double&)':
> pdf_lhapdf6.cc:598:54: error: 'std::map<int, lhapdf_amc::PDFSetHandler>::mapped_type' has no member named 'activemember'
> q2max = LHAPDF::sqr(lhapdf_amc::ACTIVESETS[nset].activemember()->info().get_entry_as<double>("QMax"));
> ^
> pdf_lhapdf6.cc:598:90: error: expected primary-expression before 'double'
> q2max = LHAPDF::sqr(lhapdf_amc::ACTIVESETS[nset].activemember()->info().get_entry_as<double>("QMax"));
> ^
> pdf_lhapdf6.cc: In function 'void getminmaxm_(const int&, const int&, double&, double&, double&, double&)':
> pdf_lhapdf6.cc:614:41: error: 'std::map<int, lhapdf_amc::PDFSetHandler>::mapped_type' has no member named 'activemember'
> xmin = lhapdf_amc::ACTIVESETS[nset].activemember()->info().get_entry_as<double>("XMin");
> ^
> pdf_lhapdf6.cc:614:77: error: expected primary-expression before 'double'
> xmin = lhapdf_amc::ACTIVESETS[nset].activemember()->info().get_entry_as<double>("XMin");
> ^
> pdf_lhapdf6.cc:614:77: error: expected ';' before 'double'
> pdf_lhapdf6.cc:615:41: error: 'std::map<int, lhapdf_amc::PDFSetHandler>::mapped_type' has no member named 'activemember'
> xmax = lhapdf_amc::ACTIVESETS[nset].activemember()->info().get_entry_as<double>("XMax");
> ^
> pdf_lhapdf6.cc:615:77: error: expected primary-expression before 'double'
> xmax = lhapdf_amc::ACTIVESETS[nset].activemember()->info().get_entry_as<double>("XMax");
> ^
> pdf_lhapdf6.cc:615:77: error: expected ';' before 'double'
> pdf_lhapdf6.cc:616:54: error: 'std::map<int, lhapdf_amc::PDFSetHandler>::mapped_type' has no member named 'activemember'
> q2min = LHAPDF::sqr(lhapdf_amc::ACTIVESETS[nset].activemember()->info().get_entry_as<double>("QMin"));
> ^
> pdf_lhapdf6.cc:616:90: error: expected primary-expression before 'double'
> q2min = LHAPDF::sqr(lhapdf_amc::ACTIVESETS[nset].activemember()->info().get_entry_as<double>("QMin"));
> ^
> pdf_lhapdf6.cc:617:54: error: 'std::map<int, lhapdf_amc::PDFSetHandler>::mapped_type' has no member named 'activemember'
> q2max = LHAPDF::sqr(lhapdf_amc::ACTIVESETS[nset].activemember()->info().get_entry_as<double>("QMax"));
> ^
> pdf_lhapdf6.cc:617:90: error: expected primary-expression before 'double'
> q2max = LHAPDF::sqr(lhapdf_amc::ACTIVESETS[nset].activemember()->info().get_entry_as<double>("QMax"));
> ^
> pdf_lhapdf6.cc: In function 'void getpdfunctypem_(const int&, int&, int&)':
> pdf_lhapdf6.cc:636:59: error: 'std::map<int, lhapdf_amc::PDFSetHandler>::mapped_type' has no member named 'activemember'
> const string errorType = lhapdf_amc::ACTIVESETS[nset].activemember()->set().errorType();
> ^
> pdf_lhapdf6.cc: In function 'void getpdfuncertaintym_(const int&, const double*, double&, double&, double&, double&)':
> pdf_lhapdf6.cc:661:54: error: 'std::map<int, lhapdf_amc::PDFSetHandler>::mapped_type' has no member named 'activemember'
> const size_t nmem = lhapdf_amc::ACTIVESETS[nset].activemember()->set().size()-1;
> ^
> pdf_lhapdf6.cc:663:63: error: 'std::map<int, lhapdf_amc::PDFSetHandler>::mapped_type' has no member named 'activemember'
> LHAPDF::PDFUncertainty err = lhapdf_amc::ACTIVESETS[nset].activemember()->set().uncertainty(vecvalues, -1);
> ^
> pdf_lhapdf6.cc: In function 'void getpdfcorrelationm_(const int&, const double*, const double*, double&)':
> pdf_lhapdf6.cc:682:54: error: 'std::map<int, lhapdf_amc::PDFSetHandler>::mapped_type' has no member named 'activemember'
> const size_t nmem = lhapdf_amc::ACTIVESETS[nset].activemember()->set().size()-1;
> ^
> pdf_lhapdf6.cc:685:48: error: 'std::map<int, lhapdf_amc::PDFSetHandler>::mapped_type' has no member named 'activemember'
> correlation = lhapdf_amc::ACTIVESETS[nset].activemember()->set().correlation(vecvaluesA,vecvaluesB);
> ^
> pdf_lhapdf6.cc: In function 'void pdfset_(const char*, const double*, int)':
> pdf_lhapdf6.cc:727:5: error: 'PDFPtr' is not a member of 'lhapdf_amc'
> lhapdf_amc::PDFPtr pdf = lhapdf_amc::ACTIVESETS[1].activemember();
> ^
> pdf_lhapdf6.cc:727:24: error: expected ';' before 'pdf'
> lhapdf_amc::PDFPtr pdf = lhapdf_amc::ACTIVESETS[1].activemember();
> ^
> pdf_lhapdf6.cc:728:20: error: 'pdf' was not declared in this scope
> w50513_.xmin = pdf->info().get_entry_as<double>("XMin", 0.0);
> ^
> pdf_lhapdf6.cc:728:45: error: expected primary-expression before 'double'
> w50513_.xmin = pdf->info().get_entry_as<double>("XMin", 0.0);
> ^
> pdf_lhapdf6.cc:728:45: error: expected ';' before 'double'
> pdf_lhapdf6.cc:729:45: error: expected primary-expression before 'double'
> w50513_.xmax = pdf->info().get_entry_as<double>("XMax", 1.0);
> ^
> pdf_lhapdf6.cc:729:45: error: expected ';' before 'double'
> pdf_lhapdf6.cc:730:58: error: expected primary-expression before 'double'
> w50513_.q2min = LHAPDF::sqr(pdf->info().get_entry_as<double>("QMin", 1.0));
> ^
> pdf_lhapdf6.cc:731:58: error: expected primary-expression before 'double'
> w50513_.q2max = LHAPDF::sqr(pdf->info().get_entry_as<double>("QMax", 1.0e5));
> ^
> pdf_lhapdf6.cc:732:46: error: expected primary-expression before 'double'
> w50512_.qcdl4 = pdf->info().get_entry_as<double>("AlphaS_Lambda4", 0.0);
> ^
> pdf_lhapdf6.cc:732:46: error: expected ';' before 'double'
> pdf_lhapdf6.cc:733:46: error: expected primary-expression before 'double'
> w50512_.qcdl5 = pdf->info().get_entry_as<double>("AlphaS_Lambda5", 0.0);
> ^
> pdf_lhapdf6.cc:733:46: error: expected ';' before 'double'
> pdf_lhapdf6.cc:734:49: error: expected primary-expression before 'double'
> lhapdfr_.qcdlha4 = pdf->info().get_entry_as<double>("AlphaS_Lambda4", 0.0);
> ^
> pdf_lhapdf6.cc:734:49: error: expected ';' before 'double'
> pdf_lhapdf6.cc:735:49: error: expected primary-expression before 'double'
> lhapdfr_.qcdlha5 = pdf->info().get_entry_as<double>("AlphaS_Lambda5", 0.0);
> ^
> pdf_lhapdf6.cc:735:49: error: expected ';' before 'double'
> pdf_lhapdf6.cc:738:34: error: expected primary-expression before 'bool'
> if (pdf->info().get_entry_as<bool>("Pythia6LambdaV5Compat", true)) {
> ^
> pdf_lhapdf6.cc:738:34: error: expected ')' before 'bool'
> pdf_lhapdf6.cc: In function 'void structm_(const double&, const double&, double&, double&, double&, double&, double&, double&, double&, double&, double&)':
> pdf_lhapdf6.cc:752:5: error: 'PDFPtr' is not a member of 'lhapdf_amc'
> lhapdf_amc::PDFPtr pdf = lhapdf_amc::ACTIVESETS[1].activemember();
> ^
> pdf_lhapdf6.cc:752:24: error: expected ';' before 'pdf'
> lhapdf_amc::PDFPtr pdf = lhapdf_amc::ACTIVESETS[1].activemember();
> ^
> pdf_lhapdf6.cc:753:12: error: 'pdf' was not declared in this scope
> dsea = pdf->xfxQ(-1, x, q);
> ^
> make[1]: *** [pdf_lhapdf6.o] Error 1
> make[1]: Leaving directory `/data9/Users/shjeon/gridpack_MG5_aMC_v2_6_0_copy1/MG5_aMC_v2_6_0/WRToNLep_MuMuJJ_WR400_N100_Tchannel_NLO/Source/PDF'
> make: *** [../lib/libpdf.a] Error 2
>
> Please try to fix this compilations issue and retry.
> Help might be found at https://answers.launchpad.net/mg5amcnlo.
> If you think that this is a bug, you can report this at https://bugs.launchpad.net/mg5amcnlo
> Value of current Options:
> text_editor : vi
> notification_center : True
> pjfry : None
> cluster_local_path : None
> group_subprocesses : Auto
> ignore_six_quark_processes : False
> loop_optimized_output : True
> cluster_status_update : (600, 30)
> fortran_compiler : None
> hepmc_path : None
> collier : /data9/Users/shjeon/gridpack_MG5_aMC_v2_6_0/MG5_aMC_v2_6_0/HEPTools/lib
> auto_update : 7
> pythia8_path : None
> hwpp_path : None
> low_mem_multicore_nlo_generation : False
> golem : None
> pythia-pgs_path : None
> td_path : None
> delphes_path : None
> thepeg_path : None
> cluster_type : sge
> madanalysis5_path : None
> exrootanalysis_path : None
> OLP : MadLoop
> applgrid : applgrid-config
> eps_viewer : None
> fastjet : None
> run_mode : 1
> web_browser : None
> automatic_html_opening : False
> cluster_temp_path : None
> cluster_size : 100
> cluster_queue : shortq
> syscalc_path : None
> madanalysis_path : None
> lhapdf : /cvmfs/cms.cern.ch/slc6_amd64_gcc481/external/lhapdf/6.2.1-ddibom/bin/lhapdf-config
> stdout_level : 20
> nb_core : 8
> f2py_compiler : /cvmfs/cms.cern.ch/slc6_amd64_gcc481/cms/cmssw/CMSSW_7_1_30/external/slc6_amd64_gcc481/bin/f2py
> ninja : /data9/Users/shjeon/gridpack_MG5_aMC_v2_6_0/MG5_aMC_v2_6_0/HEPTools/lib
> amcfast : amcfast-config
> cluster_retry_wait : 300
> output_dependencies : external
> crash_on_error : False
> mg5amc_py8_interface_path : None
> loop_color_flows : False
> samurai : None
> cluster_nb_retry : 1
> mg5_path : /data9/Users/shjeon/gridpack_MG5_aMC_v2_6_0_copy1/MG5_aMC_v2_6_0
> timeout : 60
> gauge : unitary
> complex_mass_scheme : False
> cpp_compiler : None
> max_npoint_for_channel : 0
> #************************************************************
> #* MadGraph5_aMC@NLO *
> #* *
> #* * * *
> #* * * * * *
> #* * * * * 5 * * * * *
> #* * * * * *
> #* * * *
> #* *
> #* *
> #* VERSION 2.6.0 2017-08-16 *
> #* *
> #* The MadGraph5_aMC@NLO Development Team - Find us at *
> #* https://server06.fynu.ucl.ac.be/projects/madgraph *
> #* *
> #************************************************************
> #* *
> #* Command File for MadGraph5_aMC@NLO *
> #* *
> #* run as ./bin/mg5_aMC filename *
> #* *
> #************************************************************
> set group_subprocesses Auto
> set ignore_six_quark_processes False
> set loop_optimized_output True
> set loop_color_flows False
> set gauge unitary
> set complex_mass_scheme False
> set max_npoint_for_channel 0
> import model EffLRSM_NLO
> define p = g u c d s u~ c~ d~ s~
> define j = g u c d s u~ c~ d~ s~
> define l+ = e+ mu+
> define l- = e- mu-
> define vl = ve vm vt
> define vl~ = ve~ vm~ vt~
> define p = 21 2 4 1 3 -2 -4 -1 -3 5 -5 # pass to 5 flavors
> define j = p
> define mu = mu+ mu-
> generate p a > n2 mu j QCD=0 [QCD]
> add process a p > n2 mu j QCD=0 [QCD]
> output WRToNLep_MuMuJJ_WR400_N100_Tchannel_NLO
> ######################################################################
> ## PARAM_CARD AUTOMATICALY GENERATED BY MG5 ####
> ######################################################################
> ###################################
> ## INFORMATION FOR LOOP
> ###################################
> BLOCK LOOP #
> 1 9.118800e+01 # mu_r
> ###################################
> ## INFORMATION FOR MASS
> ###################################
> BLOCK MASS #
> 6 1.733000e+02 # mt
> 23 9.118760e+01 # mz
> 25 1.257000e+02 # mh
> 32 1.000000e+14 # mzr
> 34 4.000000e+02 # mwr
> 9900012 1.000000e+14 # mn1
> 9900014 1.000000e+02 # mn2
> 9900016 1.000000e+14 # mn3
> 1 0.000000e+00 # d : 0.0
> 2 0.000000e+00 # u : 0.0
> 3 0.000000e+00 # s : 0.0
> 4 0.000000e+00 # c : 0.0
> 5 0.000000e+00 # b : 0.0
> 11 0.000000e+00 # e- : 0.0
> 12 0.000000e+00 # ve : 0.0
> 13 0.000000e+00 # mu- : 0.0
> 14 0.000000e+00 # vm : 0.0
> 15 0.000000e+00 # ta- : 0.0
> 16 0.000000e+00 # vt : 0.0
> 21 0.000000e+00 # g : 0.0
> 22 0.000000e+00 # a : 0.0
> 24 7.995123e+01 # w+ : cmath.sqrt(mz__exp__2/2. + cmath.sqrt(mz__exp__4/4. - (aew*cmath.pi*mz__exp__2)/(gf*sqrt__2)))
> 9000002 9.118760e+01 # ghz : mz
> 9000003 7.995123e+01 # ghwp : mw
> 9000004 7.995123e+01 # ghwm : mw
> ###################################
> ## INFORMATION FOR SMINPUTS
> ###################################
> BLOCK SMINPUTS #
> 1 1.279400e+02 # aewm1
> 2 1.174560e-05 # gf
> 3 1.184000e-01 # as
> ###################################
> ## INFORMATION FOR VRCOUP
> ###################################
> BLOCK VRCOUP #
> 1 1.000000e+00 # krq
> 2 1.000000e+00 # krl
> ###################################
> ## INFORMATION FOR YUKAWA
> ###################################
> BLOCK YUKAWA #
> 6 1.733000e+02 # ymt
> ###################################
> ## INFORMATION FOR DECAY
> ###################################
> BLOCK QNUMBERS 32 # zr
> 1 0 # 3 times electric charge
> 2 3 # number of spin states (2s+1)
> 3 1 # colour rep (1: singlet, 3: triplet, 8: octet)
> 4 0 # particle/antiparticle distinction (0=own anti)
> ###################################
> ## INFORMATION FOR QNUMBERS 34
> ###################################
> BLOCK QNUMBERS 34 # wr+
> 1 3 # 3 times electric charge
> 2 3 # number of spin states (2s+1)
> 3 1 # colour rep (1: singlet, 3: triplet, 8: octet)
> 4 1 # particle/antiparticle distinction (0=own anti)
> ###################################
> ## INFORMATION FOR QNUMBERS 9900012
> ###################################
> BLOCK QNUMBERS 9900012 # n1
> 1 0 # 3 times electric charge
> 2 2 # number of spin states (2s+1)
> 3 1 # colour rep (1: singlet, 3: triplet, 8: octet)
> 4 0 # particle/antiparticle distinction (0=own anti)
> ###################################
> ## INFORMATION FOR QNUMBERS 9900014
> ###################################
> BLOCK QNUMBERS 9900014 # n2
> 1 0 # 3 times electric charge
> 2 2 # number of spin states (2s+1)
> 3 1 # colour rep (1: singlet, 3: triplet, 8: octet)
> 4 0 # particle/antiparticle distinction (0=own anti)
> ###################################
> ## INFORMATION FOR QNUMBERS 9900016
> ###################################
> BLOCK QNUMBERS 9900016 # n3
> 1 0 # 3 times electric charge
> 2 2 # number of spin states (2s+1)
> 3 1 # colour rep (1: singlet, 3: triplet, 8: octet)
> 4 0 # particle/antiparticle distinction (0=own anti)
> #
> #*************************
> # Decay widths *
> #*************************
> #
> # PDG Width
> DECAY 1 0.000000e+00
> #
> # PDG Width
> DECAY 2 0.000000e+00
> #
> # PDG Width
> DECAY 3 0.000000e+00
> #
> # PDG Width
> DECAY 4 0.000000e+00
> #
> # PDG Width
> DECAY 5 0.000000e+00
> #
> # PDG Width
> DECAY 6 1.350000e+00
> #
> # PDG Width
> DECAY 11 0.000000e+00
> #
> # PDG Width
> DECAY 12 0.000000e+00
> #
> # PDG Width
> DECAY 13 0.000000e+00
> #
> # PDG Width
> DECAY 14 0.000000e+00
> #
> # PDG Width
> DECAY 15 0.000000e+00
> #
> # PDG Width
> DECAY 16 0.000000e+00
> #
> # PDG Width
> DECAY 21 0.000000e+00
> #
> # PDG Width
> DECAY 22 0.000000e+00
> #
> # PDG Width
> DECAY 23 2.495200e+00
> #
> # PDG Width
> DECAY 24 2.085000e+00
> #
> # PDG Width
> DECAY 25 4.170000e-03
> #
> # PDG Width
> DECAY 32 2.251863e+12
> # BR NDA ID1 ID2 ...
> 1.741945e-01 2 5 -5 # 3.92262149354e+11
> 1.741945e-01 2 3 -3 # 3.92262149354e+11
> 1.741945e-01 2 1 -1 # 3.92262149354e+11
> 9.894192e-02 2 6 -6 # 2.22803648797e+11
> 9.894192e-02 2 4 -4 # 2.22803648797e+11
> 9.894192e-02 2 2 -2 # 2.22803648797e+11
> 8.944502e-02 2 9900014 9900014 # 2.01417931072e+11
> 2.228712e-02 2 15 -15 # 50187540904.6
> 2.228712e-02 2 13 -13 # 50187540904.6
> 2.228712e-02 2 11 -11 # 50187540904.6
> 8.094774e-03 2 16 -16 # 18228322064.0
> 8.094774e-03 2 14 -14 # 18228322064.0
> 8.094774e-03 2 12 -12 # 18228322064.0
> #
> # PDG Width
> DECAY 34 1.022008e+01
> # BR NDA ID1 ID2 ...
> 3.307018e-01 2 4 -3 # 3.37979710223
> 3.307018e-01 2 2 -1 # 3.37979710223
> 2.386835e-01 2 6 -5 # 2.43936317379
> 9.991295e-02 2 9900014 -13 # 1.02111789893
> #
> # PDG Width
> DECAY 9000002 2.495200e+00
> #
> # PDG Width
> DECAY 9000003 2.085000e+00
> #
> # PDG Width
> DECAY 9000004 2.085000e+00
> #
> # PDG Width
> DECAY 9900012 2.120000e-08
> #
> # PDG Width
> DECAY 9900014 4.441500e-06
> # BR NDA ID1 ID2 ...
> 2.512890e-01 3 -13 -2 1 # 1.1161000935e-06
> 2.512890e-01 3 -13 -4 3 # 1.1161000935e-06
> 2.487110e-01 3 -1 2 13 # 1.1046499065e-06
> 2.487110e-01 3 -3 4 13 # 1.1046499065e-06
> #
> # PDG Width
> DECAY 9900016 1.000000e+02
> #***********************************************************************
> # MadGraph5_aMC@NLO *
> # *
> # run_card.dat aMC@NLO *
> # *
> # This file is used to set the parameters of the run. *
> # *
> # Some notation/conventions: *
> # *
> # Lines starting with a hash (#) are info or comments *
> # *
> # mind the format: value = variable ! comment *
> # *
> # Some of the values of variables can be list. These can either be *
> # comma or space separated. *
> #***********************************************************************
> #
> #*******************
> # Running parameters
> #*******************
> #
> #***********************************************************************
> # Tag name for the run (one word) *
> #***********************************************************************
> tag_1 = run_tag ! name of the run
> #***********************************************************************
> # Number of LHE events (and their normalization) and the required *
> # (relative) accuracy on the Xsec. *
> # These values are ignored for fixed order runs *
> #***********************************************************************
> 1000 = nevents ! Number of unweighted events requested
> -1.0 = req_acc ! Required accuracy (-1=auto determined from nevents)
> -1 = nevt_job ! Max number of events per job in event generation.
> ! (-1= no split).
> #***********************************************************************
> # Normalize the weights of LHE events such that they sum or average to *
> # the total cross section *
> #***********************************************************************
> average = event_norm ! valid settings: average, sum, bias
> #***********************************************************************
> # Number of points per itegration channel (ignored for aMC@NLO runs) *
> #***********************************************************************
> 0.01 = req_acc_fo ! Required accuracy (-1=ignored, and use the
> ! number of points and iter. below)
> # These numbers are ignored except if req_acc_FO is equal to -1
> 5000 = npoints_fo_grid ! number of points to setup grids
> 4 = niters_fo_grid ! number of iter. to setup grids
> 10000 = npoints_fo ! number of points to compute Xsec
> 6 = niters_fo ! number of iter. to compute Xsec
> #***********************************************************************
> # Random number seed *
> #***********************************************************************
> 0 = iseed ! rnd seed (0=assigned automatically=default))
> #***********************************************************************
> # Collider type and energy *
> #***********************************************************************
> 1 = lpp1 ! beam 1 type (0 = no PDF)
> 1 = lpp2 ! beam 2 type (0 = no PDF)
> 6500.0 = ebeam1 ! beam 1 energy in GeV
> 6500.0 = ebeam2 ! beam 2 energy in GeV
> #***********************************************************************
> # PDF choice: this automatically fixes also alpha_s(MZ) and its evol. *
> #***********************************************************************
> lhapdf = pdlabel ! PDF set
> 82200 = lhaid ! If pdlabel=lhapdf, this is the lhapdf number. Only
> ! numbers for central PDF sets are allowed. Can be a list;
> ! PDF sets beyond the first are included via reweighting.
> #***********************************************************************
> # Include the NLO Monte Carlo subtr. terms for the following parton *
> # shower (HERWIG6 | HERWIGPP | PYTHIA6Q | PYTHIA6PT | PYTHIA8) *
> # WARNING: PYTHIA6PT works only for processes without FSR!!!! *
> #***********************************************************************
> HERWIG6 = parton_shower
> 1.0 = shower_scale_factor ! multiply default shower starting
> ! scale by this factor
> #***********************************************************************
> # Renormalization and factorization scales *
> # (Default functional form for the non-fixed scales is the sum of *
> # the transverse masses divided by two of all final state particles *
> # and partons. This can be changed in SubProcesses/set_scales.f or via *
> # dynamical_scale_choice option) *
> #***********************************************************************
> False = fixed_ren_scale ! if .true. use fixed ren scale
> False = fixed_fac_scale ! if .true. use fixed fac scale
> 91.118 = mur_ref_fixed ! fixed ren reference scale
> 91.118 = muf_ref_fixed ! fixed fact reference scale
> -1 = dynamical_scale_choice ! Choose one (or more) of the predefined
> ! dynamical choices. Can be a list; scale choices beyond the
> ! first are included via reweighting
> 1.0 = mur_over_ref ! ratio of current muR over reference muR
> 1.0 = muf_over_ref ! ratio of current muF over reference muF
> #***********************************************************************
> # Reweight variables for scale dependence and PDF uncertainty *
> #***********************************************************************
> 1.0, 2.0, 0.5 = rw_rscale ! muR factors to be included by reweighting
> 1.0, 2.0, 0.5 = rw_fscale ! muF factors to be included by reweighting
> False = reweight_scale ! Reweight to get scale variation using the
> ! rw_rscale and rw_fscale factors. Should be a list of
> ! booleans of equal length to dynamical_scale_choice to
> ! specify for which choice to include scale dependence.
> False = reweight_pdf ! Reweight to get PDF uncertainty. Should be a
> ! list booleans of equal length to lhaid to specify for
> ! which PDF set to include the uncertainties.
> #***********************************************************************
> # Store reweight information in the LHE file for off-line model- *
> # parameter reweighting at NLO+PS accuracy *
> #***********************************************************************
> False = store_rwgt_info ! Store info for reweighting in LHE file
> #***********************************************************************
> # ickkw parameter: *
> # 0: No merging *
> # 3: FxFx Merging - WARNING! Applies merging only at the hard-event *
> # level. After showering an MLM-type merging should be applied as *
> # well. See http://amcatnlo.cern.ch/FxFx_merging.htm for details. *
> # 4: UNLOPS merging (with pythia8 only). No interface from within *
> # MG5_aMC available, but available in Pythia8. *
> # -1: NNLL+NLO jet-veto computation. See arxiv:1412.8408 [hep-ph]. *
> #***********************************************************************
> 0 = ickkw
> #***********************************************************************
> #
> #***********************************************************************
> # BW cutoff (M+/-bwcutoff*Gamma). Determines which resonances are *
> # written in the LHE event file *
> #***********************************************************************
> 15.0 = bwcutoff
> #***********************************************************************
> # Cuts on the jets. Jet clustering is performed by FastJet. *
> # - When matching to a parton shower, these generation cuts should be *
> # considerably softer than the analysis cuts. *
> # - More specific cuts can be specified in SubProcesses/cuts.f *
> #***********************************************************************
> 1.0 = jetalgo ! FastJet jet algorithm (1=kT, 0=C/A, -1=anti-kT)
> 0.7 = jetradius ! The radius parameter for the jet algorithm
> 0.0 = ptj ! Min jet transverse momentum
> -1.0 = etaj ! Max jet abs(pseudo-rap) (a value .lt.0 means no cut)
> #***********************************************************************
> # Cuts on the charged leptons (e+, e-, mu+, mu-, tau+ and tau-) *
> # More specific cuts can be specified in SubProcesses/cuts.f *
> #***********************************************************************
> 0.0 = ptl ! Min lepton transverse momentum
> -1.0 = etal ! Max lepton abs(pseudo-rap) (a value .lt.0 means no cut)
> 0.0 = drll ! Min distance between opposite sign lepton pairs
> 0.0 = drll_sf ! Min distance between opp. sign same-flavor lepton pairs
> 0.0 = mll ! Min inv. mass of all opposite sign lepton pairs
> 0.0 = mll_sf ! Min inv. mass of all opp. sign same-flavor lepton pairs
> #***********************************************************************
> # Photon-isolation cuts, according to hep-ph/9801442. When ptgmin=0, *
> # all the other parameters are ignored. *
> # More specific cuts can be specified in SubProcesses/cuts.f *
> #***********************************************************************
> 0.0 = ptgmin ! Min photon transverse momentum
> -1.0 = etagamma ! Max photon abs(pseudo-rap)
> 0.4 = r0gamma ! Radius of isolation code
> 1.0 = xn ! n parameter of eq.(3.4) in hep-ph/9801442
> 1.0 = epsgamma ! epsilon_gamma parameter of eq.(3.4) in hep-ph/9801442
> True = isoem ! isolate photons from EM energy (photons and leptons)
> #***********************************************************************
> # For aMCfast+APPLGRID use in PDF fitting (http://amcfast.hepforge.org)*
> #***********************************************************************
> 0 = iappl ! aMCfast switch (0=OFF, 1=prepare grids, 2=fill grids)
> #***********************************************************************
>
>
> --
> You received this question notification because you are an answer
> contact for MadGraph5_aMC@NLO.

Sihyun Jeon (shjeon) said : #2

Thanks Olivier Mattelaer, that solved my question.