install ExRootAnalysis fails on Mac OS X 10.12

Asked by Enkhbat Tsedenbaljir on 2017-12-04

I am having a problem with install ExRootAnalysis. I just installed root v6 macosx64 from binary. It seems this has something to do with the root. The whole error log is :
MG5_aMC>install ExRootAnalysis
  % Total % Received % Xferd Average Speed Time Time Time Current
                                 Dload Upload Total Spent Left Speed
100 49586 100 49586 0 0 76750 0 --:--:-- --:--:-- --:--:-- 76758
compile ExRootAnalysis. This might take a while.
>> Generating tmp/src/
Warning in cling::IncrementalParser::CheckABICompatibility():
  Possible C++ standard library mismatch, compiled with _LIBCPP_VERSION '3700'
  Extraction of runtime standard library version was: '4000'
In file included from input_line_9:1:
In file included from ./src/ExRootAnalysisLinkDef.h:13:
In file included from ./ExRootAnalysis/ExRootClasses.h:22:
In file included from /usr/local/root/include/TRefArray.h:25:
In file included from /usr/local/root/include/TSeqCollection.h:25:
In file included from /usr/local/root/include/TCollection.h:29:
In file included from /usr/local/root/include/TString.h:28:
/usr/local/root/include/RStringView.h:35:12: error: unknown type name 'basic_string_view'
   typedef basic_string_view<char> string_view;
/usr/local/root/include/RStringView.h:35:29: error: expected unqualified-id
   typedef basic_string_view<char> string_view;
/usr/local/root/include/RStringView.h:36:12: error: unknown type name 'basic_string_view'
   typedef basic_string_view<char16_t> u16string_view;
/usr/local/root/include/RStringView.h:36:29: error: expected unqualified-id
   typedef basic_string_view<char16_t> u16string_view;
/usr/local/root/include/RStringView.h:37:12: error: unknown type name 'basic_string_view'
   typedef basic_string_view<char32_t> u32string_view;
/usr/local/root/include/RStringView.h:37:29: error: expected unqualified-id
   typedef basic_string_view<char32_t> u32string_view;
/usr/local/root/include/RStringView.h:38:12: error: unknown type name 'basic_string_view'
   typedef basic_string_view<wchar_t> wstring_view;
/usr/local/root/include/RStringView.h:38:29: error: expected unqualified-id
   typedef basic_string_view<wchar_t> wstring_view;
Error: rootcint: Linkdef compilation failure
make: *** [tmp/src/] Error 1
Error detected during the compilation. Please check the compilation error and run make manually.
save configuration file to /usr/local/Cellar/madgraph5_amcatnlo/2.5.1/input/mg5_configuration.txt

Question information

English Edit question
MadGraph5_aMC@NLO Edit question
No assignee Edit question
Last query:
Last reply:

Can you help with this problem?

Provide an answer of your own, or ask Enkhbat Tsedenbaljir for more information if necessary.

To post a message you must log in.