an error while generating NLO events

Asked by Haneol Lee on 2017-11-30

Dear MG team,

I'm trying to generate NLO events using MG5_v2.6.0 but an error occurs.

I'm using SL6, gfortran 4.8.2 and fastjet 3.3.0.

There is no problem with generating LO events using MG5_v2.6.0
and also no problem with generating NLO events using MG5_v2.3.3 on this machine.

Please take a look.

Thanks,
Haneol

=======================================================

WARNING: fct <function compile_dir at 0x24942a8> does not return 0. Stopping the code in a clean way. The error was:
A compilation Error occurs when trying to compile /data7/Users/helee/MG5_aMC_v2_6_0/ZR_NLO/SubProcesses/P0_ddx_zr_n1n1.
The compilation fails with the following output message:
    gfortran -O -fno-automatic -ffixed-line-length-132 -c -I. -I../../lib/ check_poles.f
    check_poles.f:130.15:

         1 pmass_rambo, prambo)
                   1
    Warning: Actual argument contains too few elements for dummy argument 'xm' (5/100) at (1)
    check_poles.f:160.19:

         1 pmass_rambo, prambo)
                       1
    Warning: Actual argument contains too few elements for dummy argument 'xm' (5/100) at (1)
    run.inc:74.21:
        Included at check_poles.f:48:

          common/to_rwgt/ do_rwgt_scale, rw_Fscale_down, rw_Fscale_up, rw_Rscale_do
                         1
    Warning: Padding of 4 bytes required before 'rw_fscale_down' in COMMON 'to_rwgt' at (1); reorder elements or use -fno-align-commons
    gfortran -O -fno-automatic -ffixed-line-length-132 -c -I. -I../../lib/ BinothLHA.f
    gfortran -O -fno-automatic -ffixed-line-length-132 -c -I. -I../../lib/ born_hel.f
    for dir in `ls -d V*`; do cd $dir; make; cd ../; done
    make[1]: Entering directory `/data7/Users/helee/MG5_aMC_v2_6_0/ZR_NLO/SubProcesses/P0_ddx_zr_n1n1/V0_ddx_zr_n1n1'
    rm -f ../libMadLoop.a
    gfortran -fno-automatic -ffixed-line-length-132 -O3 -c polynomial.f -o polynomial.o
    gfortran -O -fno-automatic -ffixed-line-length-132 -c loop_matrix.f -I /data7/Users/helee/MG5_aMC_v2_6_0/HEPTools/include
    gfortran -O -fno-automatic -ffixed-line-length-132 -c improve_ps.f -I /data7/Users/helee/MG5_aMC_v2_6_0/HEPTools/include
    gfortran -O -fno-automatic -ffixed-line-length-132 -c born_matrix.f -I /data7/Users/helee/MG5_aMC_v2_6_0/HEPTools/include
    gfortran -O -fno-automatic -ffixed-line-length-132 -c loop_num.f -I /data7/Users/helee/MG5_aMC_v2_6_0/HEPTools/include
    gfortran -O -fno-automatic -ffixed-line-length-132 -c CT_interface.f -I /data7/Users/helee/MG5_aMC_v2_6_0/HEPTools/include
    gfortran -O -fno-automatic -ffixed-line-length-132 -c MadLoopCommons.f -I /data7/Users/helee/MG5_aMC_v2_6_0/HEPTools/include
    MadLoopCommons.f:552.35:

                LOCATION = FINDMINIMUM(X, I, MSIZE) ! find min from this to last
                                       1
    Warning: Type mismatch in argument 'x' at (1); passed REAL(8) to INTEGER(4)
    gfortran -O -fno-automatic -ffixed-line-length-132 -c MadLoopParamReader.f -I /data7/Users/helee/MG5_aMC_v2_6_0/HEPTools/include
    gfortran -O -fno-automatic -ffixed-line-length-132 -c helas_calls_ampb_1.f -I /data7/Users/helee/MG5_aMC_v2_6_0/HEPTools/include
    gfortran -O -fno-automatic -ffixed-line-length-132 -c mp_compute_loop_coefs.f -I /data7/Users/helee/MG5_aMC_v2_6_0/HEPTools/include
    gfortran -O -fno-automatic -ffixed-line-length-132 -c mp_helas_calls_ampb_1.f -I /data7/Users/helee/MG5_aMC_v2_6_0/HEPTools/include
    gfortran -O -fno-automatic -ffixed-line-length-132 -c coef_construction_1.f -I /data7/Users/helee/MG5_aMC_v2_6_0/HEPTools/include
    gfortran -O -fno-automatic -ffixed-line-length-132 -c loop_CT_calls_1.f -I /data7/Users/helee/MG5_aMC_v2_6_0/HEPTools/include
    gfortran -O -fno-automatic -ffixed-line-length-132 -c mp_coef_construction_1.f -I /data7/Users/helee/MG5_aMC_v2_6_0/HEPTools/include
    gfortran -O -fno-automatic -ffixed-line-length-132 -c TIR_interface.f -I /data7/Users/helee/MG5_aMC_v2_6_0/HEPTools/include
    mv libMadLoop.a ../
    make[1]: Leaving directory `/data7/Users/helee/MG5_aMC_v2_6_0/ZR_NLO/SubProcesses/P0_ddx_zr_n1n1/V0_ddx_zr_n1n1'
    gfortran -o check_poles parton_lum_1.o parton_lum_2.o parton_lum_3.o parton_lum_chooser.o matrix_1.o matrix_2.o matrix_3.o real_me_chooser.o leshouche_inc_chooser.o fks_inc_chooser.o setcuts.o setscales.o born.o sborn_sf.o b_sf_001.o fks_Sij.o fastjetfortran_madfks_full.o fastjet_wrapper.o fks_singular.o veto_xsec.o montecarlocounter.o reweight_xsec.o boostwdir2.o configs_and_props_inc_chooser.o initcluster.o cluster.o reweight.o get_color.o FKSParamReader.o iproc_map.o MC_integer.o reweight_xsec_events_pdf_dummy.o appl_interface_dummy.o genps_fks.o weight_lines.o cuts.o pythia_unlops.o recluster.o check_poles.o BinothLHA.o born_hel.o -L../../lib/ libMadLoop.a -lcts -liregi -L/data7/Users/helee/MG5_aMC_v2_6_0/HEPTools/lib/ -lninja -L/data7/Users/helee/MG5_aMC_v2_6_0/HEPTools/lib/ -lavh_olo -L../../lib/ -ldhelas -lgeneric -lmodel -lpdf -lcernlib -Wl,-rpath,/data7/Users/helee/MG5_aMC_v2_6_0/fastjet-install/lib -lm -L/data7/Users/helee/MG5_aMC_v2_6_0/fastjet-install/lib -lfastjettools -lfastjet -lfastjetplugins -lsiscone_spherical -lsiscone -lstdc++ -lstdc++
    /data7/Users/helee/MG5_aMC_v2_6_0/HEPTools/lib//libavh_olo.a(avh_olo.o): In function `__avh_olo_qp_print_MOD_printr':
    avh_olo.f90:(.text+0x8a312): undefined reference to `_gfortran_transfer_real128_write'
    collect2: error: ld returned 1 exit status
    make: *** [check_poles] Error 1

Please try to fix this compilations issue and retry.
Help might be found at https://answers.launchpad.net/mg5amcnlo.
If you think that this is a bug, you can report this at https://bugs.launchpad.net/mg5amcnlo
WARNING: fct <function compile_dir at 0x24942a8> does not return 0. Stopping the code in a clean way. The error was:
A compilation Error occurs when trying to compile /data7/Users/helee/MG5_aMC_v2_6_0/ZR_NLO/SubProcesses/P0_uux_zr_n1n1.
The compilation fails with the following output message:
    gfortran -O -fno-automatic -ffixed-line-length-132 -c -I. -I../../lib/ check_poles.f
    check_poles.f:130.15:

         1 pmass_rambo, prambo)
                   1
    Warning: Actual argument contains too few elements for dummy argument 'xm' (5/100) at (1)
    check_poles.f:160.19:

         1 pmass_rambo, prambo)
                       1
    Warning: Actual argument contains too few elements for dummy argument 'xm' (5/100) at (1)
    run.inc:74.21:
        Included at check_poles.f:48:

          common/to_rwgt/ do_rwgt_scale, rw_Fscale_down, rw_Fscale_up, rw_Rscale_do
                         1
    Warning: Padding of 4 bytes required before 'rw_fscale_down' in COMMON 'to_rwgt' at (1); reorder elements or use -fno-align-commons
    gfortran -O -fno-automatic -ffixed-line-length-132 -c -I. -I../../lib/ BinothLHA.f
    gfortran -O -fno-automatic -ffixed-line-length-132 -c -I. -I../../lib/ born_hel.f
    for dir in `ls -d V*`; do cd $dir; make; cd ../; done
    make[1]: Entering directory `/data7/Users/helee/MG5_aMC_v2_6_0/ZR_NLO/SubProcesses/P0_uux_zr_n1n1/V0_uux_zr_n1n1'
    rm -f ../libMadLoop.a
    gfortran -fno-automatic -ffixed-line-length-132 -O3 -c polynomial.f -o polynomial.o
    gfortran -O -fno-automatic -ffixed-line-length-132 -c loop_matrix.f -I /data7/Users/helee/MG5_aMC_v2_6_0/HEPTools/include
    gfortran -O -fno-automatic -ffixed-line-length-132 -c improve_ps.f -I /data7/Users/helee/MG5_aMC_v2_6_0/HEPTools/include
    gfortran -O -fno-automatic -ffixed-line-length-132 -c born_matrix.f -I /data7/Users/helee/MG5_aMC_v2_6_0/HEPTools/include
    gfortran -O -fno-automatic -ffixed-line-length-132 -c loop_num.f -I /data7/Users/helee/MG5_aMC_v2_6_0/HEPTools/include
    gfortran -O -fno-automatic -ffixed-line-length-132 -c CT_interface.f -I /data7/Users/helee/MG5_aMC_v2_6_0/HEPTools/include
    gfortran -O -fno-automatic -ffixed-line-length-132 -c MadLoopCommons.f -I /data7/Users/helee/MG5_aMC_v2_6_0/HEPTools/include
    MadLoopCommons.f:552.35:

                LOCATION = FINDMINIMUM(X, I, MSIZE) ! find min from this to last
                                       1
    Warning: Type mismatch in argument 'x' at (1); passed REAL(8) to INTEGER(4)
    gfortran -O -fno-automatic -ffixed-line-length-132 -c MadLoopParamReader.f -I /data7/Users/helee/MG5_aMC_v2_6_0/HEPTools/include
    gfortran -O -fno-automatic -ffixed-line-length-132 -c helas_calls_ampb_1.f -I /data7/Users/helee/MG5_aMC_v2_6_0/HEPTools/include
    gfortran -O -fno-automatic -ffixed-line-length-132 -c mp_compute_loop_coefs.f -I /data7/Users/helee/MG5_aMC_v2_6_0/HEPTools/include
    gfortran -O -fno-automatic -ffixed-line-length-132 -c mp_helas_calls_ampb_1.f -I /data7/Users/helee/MG5_aMC_v2_6_0/HEPTools/include
    gfortran -O -fno-automatic -ffixed-line-length-132 -c coef_construction_1.f -I /data7/Users/helee/MG5_aMC_v2_6_0/HEPTools/include
    gfortran -O -fno-automatic -ffixed-line-length-132 -c loop_CT_calls_1.f -I /data7/Users/helee/MG5_aMC_v2_6_0/HEPTools/include
    gfortran -O -fno-automatic -ffixed-line-length-132 -c mp_coef_construction_1.f -I /data7/Users/helee/MG5_aMC_v2_6_0/HEPTools/include
    gfortran -O -fno-automatic -ffixed-line-length-132 -c TIR_interface.f -I /data7/Users/helee/MG5_aMC_v2_6_0/HEPTools/include
    mv libMadLoop.a ../
    make[1]: Leaving directory `/data7/Users/helee/MG5_aMC_v2_6_0/ZR_NLO/SubProcesses/P0_uux_zr_n1n1/V0_uux_zr_n1n1'
    gfortran -o check_poles parton_lum_1.o parton_lum_2.o parton_lum_3.o parton_lum_chooser.o matrix_1.o matrix_2.o matrix_3.o real_me_chooser.o leshouche_inc_chooser.o fks_inc_chooser.o setcuts.o setscales.o born.o sborn_sf.o b_sf_001.o fks_Sij.o fastjetfortran_madfks_full.o fastjet_wrapper.o fks_singular.o veto_xsec.o montecarlocounter.o reweight_xsec.o boostwdir2.o configs_and_props_inc_chooser.o initcluster.o cluster.o reweight.o get_color.o FKSParamReader.o iproc_map.o MC_integer.o reweight_xsec_events_pdf_dummy.o appl_interface_dummy.o genps_fks.o weight_lines.o cuts.o pythia_unlops.o recluster.o check_poles.o BinothLHA.o born_hel.o -L../../lib/ libMadLoop.a -lcts -liregi -L/data7/Users/helee/MG5_aMC_v2_6_0/HEPTools/lib/ -lninja -L/data7/Users/helee/MG5_aMC_v2_6_0/HEPTools/lib/ -lavh_olo -L../../lib/ -ldhelas -lgeneric -lmodel -lpdf -lcernlib -Wl,-rpath,/data7/Users/helee/MG5_aMC_v2_6_0/fastjet-install/lib -lm -L/data7/Users/helee/MG5_aMC_v2_6_0/fastjet-install/lib -lfastjettools -lfastjet -lfastjetplugins -lsiscone_spherical -lsiscone -lstdc++ -lstdc++
    /data7/Users/helee/MG5_aMC_v2_6_0/HEPTools/lib//libavh_olo.a(avh_olo.o): In function `__avh_olo_qp_print_MOD_printr':
    avh_olo.f90:(.text+0x8a312): undefined reference to `_gfortran_transfer_real128_write'
    collect2: error: ld returned 1 exit status
    make: *** [check_poles] Error 1

Please try to fix this compilations issue and retry.
Help might be found at https://answers.launchpad.net/mg5amcnlo.
If you think that this is a bug, you can report this at https://bugs.launchpad.net/mg5amcnlo
WARNING: fct <function compile_dir at 0x24942a8> does not return 0. Stopping the code in a clean way. The error was:
A compilation Error occurs when trying to compile /data7/Users/helee/MG5_aMC_v2_6_0/ZR_NLO/SubProcesses/P0_uxu_zr_n1n1.
The compilation fails with the following output message:
    gfortran -O -fno-automatic -ffixed-line-length-132 -c -I. -I../../lib/ check_poles.f
    check_poles.f:130.15:

         1 pmass_rambo, prambo)
                   1
    Warning: Actual argument contains too few elements for dummy argument 'xm' (5/100) at (1)
    check_poles.f:160.19:

         1 pmass_rambo, prambo)
                       1
    Warning: Actual argument contains too few elements for dummy argument 'xm' (5/100) at (1)
    run.inc:74.21:
        Included at check_poles.f:48:

          common/to_rwgt/ do_rwgt_scale, rw_Fscale_down, rw_Fscale_up, rw_Rscale_do
                         1
    Warning: Padding of 4 bytes required before 'rw_fscale_down' in COMMON 'to_rwgt' at (1); reorder elements or use -fno-align-commons
    gfortran -O -fno-automatic -ffixed-line-length-132 -c -I. -I../../lib/ BinothLHA.f
    gfortran -O -fno-automatic -ffixed-line-length-132 -c -I. -I../../lib/ born_hel.f
    for dir in `ls -d V*`; do cd $dir; make; cd ../; done
    make[1]: Entering directory `/data7/Users/helee/MG5_aMC_v2_6_0/ZR_NLO/SubProcesses/P0_uxu_zr_n1n1/V0_uxu_zr_n1n1'
    rm -f ../libMadLoop.a
    gfortran -fno-automatic -ffixed-line-length-132 -O3 -c polynomial.f -o polynomial.o
    gfortran -O -fno-automatic -ffixed-line-length-132 -c loop_matrix.f -I /data7/Users/helee/MG5_aMC_v2_6_0/HEPTools/include
    gfortran -O -fno-automatic -ffixed-line-length-132 -c improve_ps.f -I /data7/Users/helee/MG5_aMC_v2_6_0/HEPTools/include
    gfortran -O -fno-automatic -ffixed-line-length-132 -c born_matrix.f -I /data7/Users/helee/MG5_aMC_v2_6_0/HEPTools/include
    gfortran -O -fno-automatic -ffixed-line-length-132 -c loop_num.f -I /data7/Users/helee/MG5_aMC_v2_6_0/HEPTools/include
    gfortran -O -fno-automatic -ffixed-line-length-132 -c CT_interface.f -I /data7/Users/helee/MG5_aMC_v2_6_0/HEPTools/include
    gfortran -O -fno-automatic -ffixed-line-length-132 -c MadLoopCommons.f -I /data7/Users/helee/MG5_aMC_v2_6_0/HEPTools/include
    MadLoopCommons.f:552.35:

                LOCATION = FINDMINIMUM(X, I, MSIZE) ! find min from this to last
                                       1
    Warning: Type mismatch in argument 'x' at (1); passed REAL(8) to INTEGER(4)
    gfortran -O -fno-automatic -ffixed-line-length-132 -c MadLoopParamReader.f -I /data7/Users/helee/MG5_aMC_v2_6_0/HEPTools/include
    gfortran -O -fno-automatic -ffixed-line-length-132 -c helas_calls_ampb_1.f -I /data7/Users/helee/MG5_aMC_v2_6_0/HEPTools/include
    gfortran -O -fno-automatic -ffixed-line-length-132 -c mp_compute_loop_coefs.f -I /data7/Users/helee/MG5_aMC_v2_6_0/HEPTools/include
    gfortran -O -fno-automatic -ffixed-line-length-132 -c mp_helas_calls_ampb_1.f -I /data7/Users/helee/MG5_aMC_v2_6_0/HEPTools/include
    gfortran -O -fno-automatic -ffixed-line-length-132 -c coef_construction_1.f -I /data7/Users/helee/MG5_aMC_v2_6_0/HEPTools/include
    gfortran -O -fno-automatic -ffixed-line-length-132 -c loop_CT_calls_1.f -I /data7/Users/helee/MG5_aMC_v2_6_0/HEPTools/include
    gfortran -O -fno-automatic -ffixed-line-length-132 -c mp_coef_construction_1.f -I /data7/Users/helee/MG5_aMC_v2_6_0/HEPTools/include
    gfortran -O -fno-automatic -ffixed-line-length-132 -c TIR_interface.f -I /data7/Users/helee/MG5_aMC_v2_6_0/HEPTools/include
    mv libMadLoop.a ../
    make[1]: Leaving directory `/data7/Users/helee/MG5_aMC_v2_6_0/ZR_NLO/SubProcesses/P0_uxu_zr_n1n1/V0_uxu_zr_n1n1'
    gfortran -o check_poles parton_lum_1.o parton_lum_2.o parton_lum_3.o parton_lum_chooser.o matrix_1.o matrix_2.o matrix_3.o real_me_chooser.o leshouche_inc_chooser.o fks_inc_chooser.o setcuts.o setscales.o born.o sborn_sf.o b_sf_001.o fks_Sij.o fastjetfortran_madfks_full.o fastjet_wrapper.o fks_singular.o veto_xsec.o montecarlocounter.o reweight_xsec.o boostwdir2.o configs_and_props_inc_chooser.o initcluster.o cluster.o reweight.o get_color.o FKSParamReader.o iproc_map.o MC_integer.o reweight_xsec_events_pdf_dummy.o appl_interface_dummy.o genps_fks.o weight_lines.o cuts.o pythia_unlops.o recluster.o check_poles.o BinothLHA.o born_hel.o -L../../lib/ libMadLoop.a -lcts -liregi -L/data7/Users/helee/MG5_aMC_v2_6_0/HEPTools/lib/ -lninja -L/data7/Users/helee/MG5_aMC_v2_6_0/HEPTools/lib/ -lavh_olo -L../../lib/ -ldhelas -lgeneric -lmodel -lpdf -lcernlib -Wl,-rpath,/data7/Users/helee/MG5_aMC_v2_6_0/fastjet-install/lib -lm -L/data7/Users/helee/MG5_aMC_v2_6_0/fastjet-install/lib -lfastjettools -lfastjet -lfastjetplugins -lsiscone_spherical -lsiscone -lstdc++ -lstdc++
    /data7/Users/helee/MG5_aMC_v2_6_0/HEPTools/lib//libavh_olo.a(avh_olo.o): In function `__avh_olo_qp_print_MOD_printr':
    avh_olo.f90:(.text+0x8a312): undefined reference to `_gfortran_transfer_real128_write'
    collect2: error: ld returned 1 exit status
    make: *** [check_poles] Error 1

Please try to fix this compilations issue and retry.
Help might be found at https://answers.launchpad.net/mg5amcnlo.
If you think that this is a bug, you can report this at https://bugs.launchpad.net/mg5amcnlo
WARNING: fct <function compile_dir at 0x24942a8> does not return 0. Stopping the code in a clean way. The error was:
A compilation Error occurs when trying to compile /data7/Users/helee/MG5_aMC_v2_6_0/ZR_NLO/SubProcesses/P0_dxd_zr_n1n1.
The compilation fails with the following output message:
    gfortran -O -fno-automatic -ffixed-line-length-132 -c -I. -I../../lib/ check_poles.f
    check_poles.f:130.15:

         1 pmass_rambo, prambo)
                   1
    Warning: Actual argument contains too few elements for dummy argument 'xm' (5/100) at (1)
    check_poles.f:160.19:

         1 pmass_rambo, prambo)
                       1
    Warning: Actual argument contains too few elements for dummy argument 'xm' (5/100) at (1)
    run.inc:74.21:
        Included at check_poles.f:48:

          common/to_rwgt/ do_rwgt_scale, rw_Fscale_down, rw_Fscale_up, rw_Rscale_do
                         1
    Warning: Padding of 4 bytes required before 'rw_fscale_down' in COMMON 'to_rwgt' at (1); reorder elements or use -fno-align-commons
    gfortran -O -fno-automatic -ffixed-line-length-132 -c -I. -I../../lib/ BinothLHA.f
    gfortran -O -fno-automatic -ffixed-line-length-132 -c -I. -I../../lib/ born_hel.f
    for dir in `ls -d V*`; do cd $dir; make; cd ../; done
    make[1]: Entering directory `/data7/Users/helee/MG5_aMC_v2_6_0/ZR_NLO/SubProcesses/P0_dxd_zr_n1n1/V0_dxd_zr_n1n1'
    rm -f ../libMadLoop.a
    gfortran -fno-automatic -ffixed-line-length-132 -O3 -c polynomial.f -o polynomial.o
    gfortran -O -fno-automatic -ffixed-line-length-132 -c loop_matrix.f -I /data7/Users/helee/MG5_aMC_v2_6_0/HEPTools/include
    gfortran -O -fno-automatic -ffixed-line-length-132 -c improve_ps.f -I /data7/Users/helee/MG5_aMC_v2_6_0/HEPTools/include
    gfortran -O -fno-automatic -ffixed-line-length-132 -c born_matrix.f -I /data7/Users/helee/MG5_aMC_v2_6_0/HEPTools/include
    gfortran -O -fno-automatic -ffixed-line-length-132 -c loop_num.f -I /data7/Users/helee/MG5_aMC_v2_6_0/HEPTools/include
    gfortran -O -fno-automatic -ffixed-line-length-132 -c CT_interface.f -I /data7/Users/helee/MG5_aMC_v2_6_0/HEPTools/include
    gfortran -O -fno-automatic -ffixed-line-length-132 -c MadLoopCommons.f -I /data7/Users/helee/MG5_aMC_v2_6_0/HEPTools/include
    MadLoopCommons.f:552.35:

                LOCATION = FINDMINIMUM(X, I, MSIZE) ! find min from this to last
                                       1
    Warning: Type mismatch in argument 'x' at (1); passed REAL(8) to INTEGER(4)
    gfortran -O -fno-automatic -ffixed-line-length-132 -c MadLoopParamReader.f -I /data7/Users/helee/MG5_aMC_v2_6_0/HEPTools/include
    gfortran -O -fno-automatic -ffixed-line-length-132 -c helas_calls_ampb_1.f -I /data7/Users/helee/MG5_aMC_v2_6_0/HEPTools/include
    gfortran -O -fno-automatic -ffixed-line-length-132 -c mp_compute_loop_coefs.f -I /data7/Users/helee/MG5_aMC_v2_6_0/HEPTools/include
    gfortran -O -fno-automatic -ffixed-line-length-132 -c mp_helas_calls_ampb_1.f -I /data7/Users/helee/MG5_aMC_v2_6_0/HEPTools/include
    gfortran -O -fno-automatic -ffixed-line-length-132 -c coef_construction_1.f -I /data7/Users/helee/MG5_aMC_v2_6_0/HEPTools/include
    gfortran -O -fno-automatic -ffixed-line-length-132 -c loop_CT_calls_1.f -I /data7/Users/helee/MG5_aMC_v2_6_0/HEPTools/include
    gfortran -O -fno-automatic -ffixed-line-length-132 -c mp_coef_construction_1.f -I /data7/Users/helee/MG5_aMC_v2_6_0/HEPTools/include
    gfortran -O -fno-automatic -ffixed-line-length-132 -c TIR_interface.f -I /data7/Users/helee/MG5_aMC_v2_6_0/HEPTools/include
    mv libMadLoop.a ../
    make[1]: Leaving directory `/data7/Users/helee/MG5_aMC_v2_6_0/ZR_NLO/SubProcesses/P0_dxd_zr_n1n1/V0_dxd_zr_n1n1'
    gfortran -o check_poles parton_lum_1.o parton_lum_2.o parton_lum_3.o parton_lum_chooser.o matrix_1.o matrix_2.o matrix_3.o real_me_chooser.o leshouche_inc_chooser.o fks_inc_chooser.o setcuts.o setscales.o born.o sborn_sf.o b_sf_001.o fks_Sij.o fastjetfortran_madfks_full.o fastjet_wrapper.o fks_singular.o veto_xsec.o montecarlocounter.o reweight_xsec.o boostwdir2.o configs_and_props_inc_chooser.o initcluster.o cluster.o reweight.o get_color.o FKSParamReader.o iproc_map.o MC_integer.o reweight_xsec_events_pdf_dummy.o appl_interface_dummy.o genps_fks.o weight_lines.o cuts.o pythia_unlops.o recluster.o check_poles.o BinothLHA.o born_hel.o -L../../lib/ libMadLoop.a -lcts -liregi -L/data7/Users/helee/MG5_aMC_v2_6_0/HEPTools/lib/ -lninja -L/data7/Users/helee/MG5_aMC_v2_6_0/HEPTools/lib/ -lavh_olo -L../../lib/ -ldhelas -lgeneric -lmodel -lpdf -lcernlib -Wl,-rpath,/data7/Users/helee/MG5_aMC_v2_6_0/fastjet-install/lib -lm -L/data7/Users/helee/MG5_aMC_v2_6_0/fastjet-install/lib -lfastjettools -lfastjet -lfastjetplugins -lsiscone_spherical -lsiscone -lstdc++ -lstdc++
    /data7/Users/helee/MG5_aMC_v2_6_0/HEPTools/lib//libavh_olo.a(avh_olo.o): In function `__avh_olo_qp_print_MOD_printr':
    avh_olo.f90:(.text+0x8a312): undefined reference to `_gfortran_transfer_real128_write'
    collect2: error: ld returned 1 exit status
    make: *** [check_poles] Error 1

Please try to fix this compilations issue and retry.
Help might be found at https://answers.launchpad.net/mg5amcnlo.
If you think that this is a bug, you can report this at https://bugs.launchpad.net/mg5amcnlo
WARNING: Fail to compile the Subprocesses
INFO:

INFO: Checking test output:
INFO: P0_uux_zr_n1n1
INFO: Result for test_ME:
INFO: Passed.
INFO: Result for test_MC:
INFO: Passed.
INFO: Result for check_poles:
Command "launch auto " interrupted with error:
IOError : [Errno 2] No such file or directory: '/data7/Users/helee/MG5_aMC_v2_6_0/ZR_NLO/SubProcesses/P0_uux_zr_n1n1/check_poles.log'
Please report this bug on https://bugs.launchpad.net/mg5amcnlo
More information is found in '/data7/Users/helee/MG5_aMC_v2_6_0/ZR_NLO/run_01_tag_1_debug.log'.
Please attach this file to your report.
INFO:

quit
INFO:

Question information

Language:
English Edit question
Status:
Open
For:
MadGraph5_aMC@NLO Edit question
Assignee:
Valentin Hirschi Edit question
Last query:
2017-11-30
Last reply:

Can you help with this problem?

Provide an answer of your own, or ask Haneol Lee for more information if necessary.

To post a message you must log in.