check_poles error

Asked by Sihyun Jeon on 2017-11-30

Hi MadGraph team, I have an issue while running the madgraph.

Please take a look.

launch auto
Traceback (most recent call last):
  File "/home/shjeon/MG5_aMC_v2_6_0/madgraph/interface/extended_cmd.py", line 1438, in onecmd
    return self.onecmd_orig(line, **opt)
  File "/home/shjeon/MG5_aMC_v2_6_0/madgraph/interface/extended_cmd.py", line 1392, in onecmd_orig
    return func(arg, **opt)
  File "/home/shjeon/MG5_aMC_v2_6_0/madgraph/interface/amcatnlo_run_interface.py", line 1228, in do_launch
    self.compile(mode, options)
  File "/home/shjeon/MG5_aMC_v2_6_0/madgraph/interface/amcatnlo_run_interface.py", line 4729, in compile
    self.check_tests(test, this_dir)
  File "/home/shjeon/MG5_aMC_v2_6_0/madgraph/interface/amcatnlo_run_interface.py", line 4742, in check_tests
    return self.parse_check_poles_log(pjoin(dir, '%s.log' % test))
  File "/home/shjeon/MG5_aMC_v2_6_0/madgraph/interface/amcatnlo_run_interface.py", line 4761, in parse_check_poles_log
    content = open(log).read()
IOError: [Errno 2] No such file or directory: '/home/shjeon/MG5_aMC_v2_6_0/test/SubProcesses/P0_uux_mupmum/check_poles.log'
Related File: /home/shjeon/MG5_aMC_v2_6_0/test/SubProcesses/P0_uux_mupmum/check_poles.log

import model loop_sm-no_b_mass
define p = g u c d s u~ c~ d~ s~
define j = g u c d s u~ c~ d~ s~
define l+ = e+ mu+
define l- = e- mu-
define vl = ve vm vt
define vl~ = ve~ vm~ vt~
define p = 21 2 4 1 3 -2 -4 -1 -3 5 -5
define j = p
define q = p b b~
define j = j b b~
generate q q > mu+ mu- [QCD] @0
output test

Question information

Language:
English Edit question
Status:
Open
For:
MadGraph5_aMC@NLO Edit question
Assignee:
Valentin Hirschi Edit question
Last query:
2017-11-30
Last reply:
Sihyun Jeon (shjeon) said : #1

[shjeon@cms1 P0_uxu_mupmum]$ make check_poles
gfortran -O -fno-automatic -ffixed-line-length-132 -c -I. -I../../lib/ fks_singular.f
fks_singular.f:5452.3:

 12 continue
   1
fks_singular.f:5470.132:

                                                                           2
Warning: Legacy Extension: Label at (1) is not in the same block as the GOTO statement at (2)
fks_singular.f:3911.23:

      common/ccheckcnt/i_momcmp_count,xratmax
                       1
Warning: Padding of 4 bytes required before 'xratmax' in COMMON 'ccheckcnt' at (1); reorder elements or use -fno-align-commons
fks_singular.f:2717.20:

      common/cemsca/emsca,emsca_bare,emscasharp,scalemin,scalemax
                    1
Warning: Padding of 4 bytes required before 'scalemin' in COMMON 'cemsca' at (1); reorder elements or use -fno-align-commons
run.inc:74.21:
    Included at fks_singular.f:3704:

      common/to_rwgt/ do_rwgt_scale, rw_Fscale_down, rw_Fscale_up, rw_Rscale_do
                     1
Warning: Padding of 4 bytes required before 'rw_fscale_down' in COMMON 'to_rwgt' at (1); reorder elements or use -fno-align-commons
run.inc:74.21:
    Included at fks_singular.f:5480:

      common/to_rwgt/ do_rwgt_scale, rw_Fscale_down, rw_Fscale_up, rw_Rscale_do
                     1
Warning: Padding of 4 bytes required before 'rw_fscale_down' in COMMON 'to_rwgt' at (1); reorder elements or use -fno-align-commons
run.inc:74.21:
    Included at fks_singular.f:1022:

      common/to_rwgt/ do_rwgt_scale, rw_Fscale_down, rw_Fscale_up, rw_Rscale_do
                     1
Warning: Padding of 4 bytes required before 'rw_fscale_down' in COMMON 'to_rwgt' at (1); reorder elements or use -fno-align-commons
run.inc:74.21:
    Included at fks_singular.f:3760:

      common/to_rwgt/ do_rwgt_scale, rw_Fscale_down, rw_Fscale_up, rw_Rscale_do
                     1
Warning: Padding of 4 bytes required before 'rw_fscale_down' in COMMON 'to_rwgt' at (1); reorder elements or use -fno-align-commons
run.inc:74.21:
    Included at fks_singular.f:3598:

      common/to_rwgt/ do_rwgt_scale, rw_Fscale_down, rw_Fscale_up, rw_Rscale_do
                     1
Warning: Padding of 4 bytes required before 'rw_fscale_down' in COMMON 'to_rwgt' at (1); reorder elements or use -fno-align-commons
run.inc:74.21:
    Included at fks_singular.f:4167:

      common/to_rwgt/ do_rwgt_scale, rw_Fscale_down, rw_Fscale_up, rw_Rscale_do
                     1
Warning: Padding of 4 bytes required before 'rw_fscale_down' in COMMON 'to_rwgt' at (1); reorder elements or use -fno-align-commons
run.inc:74.21:
    Included at fks_singular.f:38:

      common/to_rwgt/ do_rwgt_scale, rw_Fscale_down, rw_Fscale_up, rw_Rscale_do
                     1
Warning: Padding of 4 bytes required before 'rw_fscale_down' in COMMON 'to_rwgt' at (1); reorder elements or use -fno-align-commons
fks_singular.f:483.27:

      common/c_FxFx_scales/FxFx_ren_scales,nFxFx_ren_scales,
                           1
Warning: Padding of 4 bytes required before 'fxfx_fac_scale' in COMMON 'c_fxfx_scales' at (1); reorder elements or use -fno-align-commons
run.inc:74.21:
    Included at fks_singular.f:455:

      common/to_rwgt/ do_rwgt_scale, rw_Fscale_down, rw_Fscale_up, rw_Rscale_do
                     1
Warning: Padding of 4 bytes required before 'rw_fscale_down' in COMMON 'to_rwgt' at (1); reorder elements or use -fno-align-commons
run.inc:74.21:
    Included at fks_singular.f:619:

      common/to_rwgt/ do_rwgt_scale, rw_Fscale_down, rw_Fscale_up, rw_Rscale_do
                     1
Warning: Padding of 4 bytes required before 'rw_fscale_down' in COMMON 'to_rwgt' at (1); reorder elements or use -fno-align-commons
run.inc:74.21:
    Included at fks_singular.f:750:

      common/to_rwgt/ do_rwgt_scale, rw_Fscale_down, rw_Fscale_up, rw_Rscale_do
                     1
Warning: Padding of 4 bytes required before 'rw_fscale_down' in COMMON 'to_rwgt' at (1); reorder elements or use -fno-align-commons
run.inc:74.21:
    Included at fks_singular.f:1158:

      common/to_rwgt/ do_rwgt_scale, rw_Fscale_down, rw_Fscale_up, rw_Rscale_do
                     1
Warning: Padding of 4 bytes required before 'rw_fscale_down' in COMMON 'to_rwgt' at (1); reorder elements or use -fno-align-commons
run.inc:74.21:
    Included at fks_singular.f:1385:

      common/to_rwgt/ do_rwgt_scale, rw_Fscale_down, rw_Fscale_up, rw_Rscale_do
                     1
Warning: Padding of 4 bytes required before 'rw_fscale_down' in COMMON 'to_rwgt' at (1); reorder elements or use -fno-align-commons
run.inc:74.21:
    Included at fks_singular.f:1457:

      common/to_rwgt/ do_rwgt_scale, rw_Fscale_down, rw_Fscale_up, rw_Rscale_do
                     1
Warning: Padding of 4 bytes required before 'rw_fscale_down' in COMMON 'to_rwgt' at (1); reorder elements or use -fno-align-commons
run.inc:74.21:
    Included at fks_singular.f:1548:

      common/to_rwgt/ do_rwgt_scale, rw_Fscale_down, rw_Fscale_up, rw_Rscale_do
                     1
Warning: Padding of 4 bytes required before 'rw_fscale_down' in COMMON 'to_rwgt' at (1); reorder elements or use -fno-align-commons
run.inc:74.21:
    Included at fks_singular.f:1899:

      common/to_rwgt/ do_rwgt_scale, rw_Fscale_down, rw_Fscale_up, rw_Rscale_do
                     1
Warning: Padding of 4 bytes required before 'rw_fscale_down' in COMMON 'to_rwgt' at (1); reorder elements or use -fno-align-commons
run.inc:74.21:
    Included at fks_singular.f:2770:

      common/to_rwgt/ do_rwgt_scale, rw_Fscale_down, rw_Fscale_up, rw_Rscale_do
                     1
Warning: Padding of 4 bytes required before 'rw_fscale_down' in COMMON 'to_rwgt' at (1); reorder elements or use -fno-align-commons
fks_singular.f:3831.23:

      common/ccheckcnt/i_momcmp_count,xratmax
                       1
Warning: Padding of 4 bytes required before 'xratmax' in COMMON 'ccheckcnt' at (1); reorder elements or use -fno-align-commons
run.inc:74.21:
    Included at fks_singular.f:5132:

      common/to_rwgt/ do_rwgt_scale, rw_Fscale_down, rw_Fscale_up, rw_Rscale_do
                     1
Warning: Padding of 4 bytes required before 'rw_fscale_down' in COMMON 'to_rwgt' at (1); reorder elements or use -fno-align-commons
gfortran -o check_poles parton_lum_1.o parton_lum_2.o parton_lum_3.o parton_lum_chooser.o matrix_1.o matrix_2.o matrix_3.o real_me_chooser.o leshouche_inc_chooser.o fks_inc_chooser.o setcuts.o setscales.o born.o sborn_sf.o b_sf_001.o fks_Sij.o fastjetfortran_madfks_core.o fjcore.o fastjet_wrapper.o fks_singular.o veto_xsec.o montecarlocounter.o reweight_xsec.o boostwdir2.o configs_and_props_inc_chooser.o initcluster.o cluster.o reweight.o get_color.o FKSParamReader.o iproc_map.o MC_integer.o reweight_xsec_events_pdf_dummy.o appl_interface_dummy.o genps_fks.o weight_lines.o cuts.o pythia_unlops.o recluster.o check_poles.o BinothLHA.o born_hel.o -L../../lib/ libMadLoop.a -lcts -liregi -L/home/shjeon/MG5_aMC_v2_6_0/HEPTools/lib/ -lninja -L/home/shjeon/MG5_aMC_v2_6_0/HEPTools/lib/ -lavh_olo -L../../lib/ -ldhelas -lgeneric -lmodel -lpdf -lcernlib -lstdc++ -lstdc++
/home/shjeon/MG5_aMC_v2_6_0/HEPTools/lib//libavh_olo.a(avh_olo.o): In function `__avh_olo_qp_print_MOD_printr':
avh_olo.f90:(.text+0x8a312): undefined reference to `_gfortran_transfer_real128_write'
collect2: error: ld returned 1 exit status
make: *** [check_poles] Error 1

Can you help with this problem?

Provide an answer of your own, or ask Sihyun Jeon for more information if necessary.

To post a message you must log in.