Problem while installing Pythia8

Asked by shibasipu on 2017-08-01

Hi Olivier,
                        I am using MG5_aMC_v2_5_5. I was trying to install pythia 8. While installing LHAPDF, it is giving some error message.\
MG5_aMC> install pythia8
   You are installing 'pythia8', please cite ref(s): arXiv:1410.3012.
Downloading the HEPToolInstaller at:
   http://madgraph.phys.ucl.ac.be/Downloads/HEPToolsInstaller/HEPToolsInstaller_V86.tar.gz
LHAPDF was not found. Do you want to install LHPADF6? (recommended) y/n >[y] [60s to answer]
>y
Now installing lhapdf6. Be patient...
--2017-08-01 15:17:46-- http://www.hepforge.org/archive/lhapdf/LHAPDF-6.1.6.tar.gz
Connecting to 202.141.80.80:3128... connected.
Proxy request sent, awaiting response... 301 Moved Permanently
Location: https://www.hepforge.org/archive/lhapdf/LHAPDF-6.1.6.tar.gz [following]
--2017-08-01 15:17:46-- https://www.hepforge.org/archive/lhapdf/LHAPDF-6.1.6.tar.gz
Connecting to 202.141.80.80:3128... connected.
Proxy request sent, awaiting response... 200 OK
Length: 696608 (680K) [application/x-gzip]
Saving to: “LHAPDF-6.1.6.tar.gz”

100%[=========================================================================================================================================================================>] 696,608 270K/s in 2.5s

2017-08-01 15:17:49 (270 KB/s) - “LHAPDF-6.1.6.tar.gz” saved [696608/696608]

Installing tool 'lhapdf6'...
    > Follow the installation progress by running the command below in a separate terminal)
    > tail -f /home/shibananda/MG5_aMC_v2_5_5/HEPTools/lhapdf6/lhapdf6_install.log
A problem occured during the installation of 'lhapdf6'.
Content of the installation log file '/home/shibananda/MG5_aMC_v2_5_5/HEPTools/lhapdf6/lhapdf6_install.log':

 Set environment variables
 Unpack LHAPDF
LHAPDF-6.1.6/
LHAPDF-6.1.6/aclocal.m4
LHAPDF-6.1.6/NEWS
LHAPDF-6.1.6/lhapdf-config.in
LHAPDF-6.1.6/config/
LHAPDF-6.1.6/config/test-driver
LHAPDF-6.1.6/config/compile
LHAPDF-6.1.6/config/depcomp
LHAPDF-6.1.6/config/config.h.in
LHAPDF-6.1.6/config/ltmain.sh
LHAPDF-6.1.6/config/config.guess
LHAPDF-6.1.6/config/install-sh
LHAPDF-6.1.6/config/missing
LHAPDF-6.1.6/config/config.sub
LHAPDF-6.1.6/tests/
LHAPDF-6.1.6/tests/testperf.cc
LHAPDF-6.1.6/tests/Makefile.in
LHAPDF-6.1.6/tests/testsetperf.cc
LHAPDF-6.1.6/tests/testpaths.cc
LHAPDF-6.1.6/tests/testindex.cc
LHAPDF-6.1.6/tests/Makefile.am
LHAPDF-6.1.6/tests/testnsetperf.cc
LHAPDF-6.1.6/tests/testinfo.cc
LHAPDF-6.1.6/tests/testgrid.cc
LHAPDF-6.1.6/tests/testalphas.cc
LHAPDF-6.1.6/Makefile.in
LHAPDF-6.1.6/configure.ac
LHAPDF-6.1.6/configure
LHAPDF-6.1.6/lhapdf.in
LHAPDF-6.1.6/ChangeLog
LHAPDF-6.1.6/lhapdf.pc.in
LHAPDF-6.1.6/lhapdf.pc
LHAPDF-6.1.6/TODO
LHAPDF-6.1.6/INSTALL
LHAPDF-6.1.6/examples/
LHAPDF-6.1.6/examples/testpdfunc.py
LHAPDF-6.1.6/examples/Makefile.in
LHAPDF-6.1.6/examples/fexample1.f
LHAPDF-6.1.6/examples/testpdfunc.cc
LHAPDF-6.1.6/examples/analyticpdf.cc
LHAPDF-6.1.6/examples/Makefile.am
LHAPDF-6.1.6/examples/compatibility.cc
LHAPDF-6.1.6/examples/hessian2replicas.cc
LHAPDF-6.1.6/examples/pythonexample.py
LHAPDF-6.1.6/examples/reweight.cc
LHAPDF-6.1.6/examples/testpdf.cc
LHAPDF-6.1.6/examples/testpdfset.cc
LHAPDF-6.1.6/AUTHORS
LHAPDF-6.1.6/Makefile.am
LHAPDF-6.1.6/pdfsets.index
LHAPDF-6.1.6/lhapdf.conf
LHAPDF-6.1.6/src/
LHAPDF-6.1.6/src/PDF.cc
LHAPDF-6.1.6/src/AlphaS.cc
LHAPDF-6.1.6/src/LogBicubicInterpolator.cc
LHAPDF-6.1.6/src/Makefile.in
LHAPDF-6.1.6/src/PDFInfo.cc
LHAPDF-6.1.6/src/ErrExtrapolator.cc
LHAPDF-6.1.6/src/AlphaS_ODE.cc
LHAPDF-6.1.6/src/NearestPointExtrapolator.cc
LHAPDF-6.1.6/src/Paths.cc
LHAPDF-6.1.6/src/CompositePDF.cc
LHAPDF-6.1.6/src/ContinuationExtrapolator.cc
LHAPDF-6.1.6/src/BilinearInterpolator.cc
LHAPDF-6.1.6/src/Makefile.am
LHAPDF-6.1.6/src/Info.cc
LHAPDF-6.1.6/src/GridPDF.cc
LHAPDF-6.1.6/src/PDFSet.cc
LHAPDF-6.1.6/src/Config.cc
LHAPDF-6.1.6/src/AlphaS_Ipol.cc
LHAPDF-6.1.6/src/BicubicInterpolator.cc
LHAPDF-6.1.6/src/LogBilinearInterpolator.cc
LHAPDF-6.1.6/src/LHAGlue.cc
LHAPDF-6.1.6/src/Factories.cc
LHAPDF-6.1.6/src/yamlcpp/
LHAPDF-6.1.6/src/yamlcpp/emitterstate.cpp
LHAPDF-6.1.6/src/yamlcpp/yaml-cpp/
LHAPDF-6.1.6/src/yamlcpp/yaml-cpp/mark.h
LHAPDF-6.1.6/src/yamlcpp/yaml-cpp/binary.h
LHAPDF-6.1.6/src/yamlcpp/yaml-cpp/yaml.h
LHAPDF-6.1.6/src/yamlcpp/yaml-cpp/emittermanip.h
LHAPDF-6.1.6/src/yamlcpp/yaml-cpp/nodeimpl.h
LHAPDF-6.1.6/src/yamlcpp/yaml-cpp/eventhandler.h
LHAPDF-6.1.6/src/yamlcpp/yaml-cpp/noncopyable.h
LHAPDF-6.1.6/src/yamlcpp/yaml-cpp/parser.h
LHAPDF-6.1.6/src/yamlcpp/yaml-cpp/stlnode.h
LHAPDF-6.1.6/src/yamlcpp/yaml-cpp/node.h
LHAPDF-6.1.6/src/yamlcpp/yaml-cpp/dll.h
LHAPDF-6.1.6/src/yamlcpp/yaml-cpp/contrib/
LHAPDF-6.1.6/src/yamlcpp/yaml-cpp/contrib/anchordict.h
LHAPDF-6.1.6/src/yamlcpp/yaml-cpp/contrib/graphbuilder.h
LHAPDF-6.1.6/src/yamlcpp/yaml-cpp/traits.h
LHAPDF-6.1.6/src/yamlcpp/yaml-cpp/null.h
LHAPDF-6.1.6/src/yamlcpp/yaml-cpp/conversion.h
LHAPDF-6.1.6/src/yamlcpp/yaml-cpp/emitter.h
LHAPDF-6.1.6/src/yamlcpp/yaml-cpp/stlemitter.h
LHAPDF-6.1.6/src/yamlcpp/yaml-cpp/aliasmanager.h
LHAPDF-6.1.6/src/yamlcpp/yaml-cpp/nodereadimpl.h
LHAPDF-6.1.6/src/yamlcpp/yaml-cpp/iterator.h
LHAPDF-6.1.6/src/yamlcpp/yaml-cpp/anchor.h
LHAPDF-6.1.6/src/yamlcpp/yaml-cpp/emitfromevents.h
LHAPDF-6.1.6/src/yamlcpp/yaml-cpp/nodeutil.h
LHAPDF-6.1.6/src/yamlcpp/yaml-cpp/ostream.h
LHAPDF-6.1.6/src/yamlcpp/yaml-cpp/ltnode.h
LHAPDF-6.1.6/src/yamlcpp/yaml-cpp/exceptions.h
LHAPDF-6.1.6/src/yamlcpp/Makefile.in
LHAPDF-6.1.6/src/yamlcpp/scanner.h
LHAPDF-6.1.6/src/yamlcpp/nodeownership.cpp
LHAPDF-6.1.6/src/yamlcpp/scantag.h
LHAPDF-6.1.6/src/yamlcpp/iterpriv.h
LHAPDF-6.1.6/src/yamlcpp/node.cpp
LHAPDF-6.1.6/src/yamlcpp/directives.h
LHAPDF-6.1.6/src/yamlcpp/stream.h
LHAPDF-6.1.6/src/yamlcpp/exp.cpp
LHAPDF-6.1.6/src/yamlcpp/nodebuilder.cpp
LHAPDF-6.1.6/src/yamlcpp/collectionstack.h
LHAPDF-6.1.6/src/yamlcpp/scantag.cpp
LHAPDF-6.1.6/src/yamlcpp/scanner.cpp
LHAPDF-6.1.6/src/yamlcpp/token.h
LHAPDF-6.1.6/src/yamlcpp/scantoken.cpp
LHAPDF-6.1.6/src/yamlcpp/binary.cpp
LHAPDF-6.1.6/src/yamlcpp/conversion.cpp
LHAPDF-6.1.6/src/yamlcpp/parser.cpp
LHAPDF-6.1.6/src/yamlcpp/emitfromevents.cpp
LHAPDF-6.1.6/src/yamlcpp/setting.h
LHAPDF-6.1.6/src/yamlcpp/singledocparser.cpp
LHAPDF-6.1.6/src/yamlcpp/exp.h
LHAPDF-6.1.6/src/yamlcpp/Makefile.am
LHAPDF-6.1.6/src/yamlcpp/tag.h
LHAPDF-6.1.6/src/yamlcpp/streamcharsource.h
LHAPDF-6.1.6/src/yamlcpp/regex.cpp
LHAPDF-6.1.6/src/yamlcpp/stream.cpp
LHAPDF-6.1.6/src/yamlcpp/regex.h
LHAPDF-6.1.6/src/yamlcpp/regeximpl.h
LHAPDF-6.1.6/src/yamlcpp/null.cpp
LHAPDF-6.1.6/src/yamlcpp/scanscalar.h
LHAPDF-6.1.6/src/yamlcpp/indentation.h
LHAPDF-6.1.6/src/yamlcpp/nodeownership.h
LHAPDF-6.1.6/src/yamlcpp/singledocparser.h
LHAPDF-6.1.6/src/yamlcpp/ptr_vector.h
LHAPDF-6.1.6/src/yamlcpp/iterator.cpp
LHAPDF-6.1.6/src/yamlcpp/simplekey.cpp
LHAPDF-6.1.6/src/yamlcpp/emitter.cpp
LHAPDF-6.1.6/src/yamlcpp/emitterutils.cpp
LHAPDF-6.1.6/src/yamlcpp/ostream.cpp
LHAPDF-6.1.6/src/yamlcpp/directives.cpp
LHAPDF-6.1.6/src/yamlcpp/scanscalar.cpp
LHAPDF-6.1.6/src/yamlcpp/emitterstate.h
LHAPDF-6.1.6/src/yamlcpp/aliasmanager.cpp
LHAPDF-6.1.6/src/yamlcpp/tag.cpp
LHAPDF-6.1.6/src/yamlcpp/ptr_stack.h
LHAPDF-6.1.6/src/yamlcpp/emitterutils.h
LHAPDF-6.1.6/src/yamlcpp/nodebuilder.h
LHAPDF-6.1.6/src/yamlcpp/stringsource.h
LHAPDF-6.1.6/src/AlphaS_Analytic.cc
LHAPDF-6.1.6/src/Interpolator.cc
LHAPDF-6.1.6/README
LHAPDF-6.1.6/COPYING
LHAPDF-6.1.6/include/
LHAPDF-6.1.6/include/Makefile.in
LHAPDF-6.1.6/include/Makefile.am
LHAPDF-6.1.6/include/LHAPDF/
LHAPDF-6.1.6/include/LHAPDF/BilinearInterpolator.h
LHAPDF-6.1.6/include/LHAPDF/Version.h.in
LHAPDF-6.1.6/include/LHAPDF/PDFSet.h
LHAPDF-6.1.6/include/LHAPDF/PDFIndex.h
LHAPDF-6.1.6/include/LHAPDF/ErrExtrapolator.h
LHAPDF-6.1.6/include/LHAPDF/LHAPDF.h
LHAPDF-6.1.6/include/LHAPDF/LogBilinearInterpolator.h
LHAPDF-6.1.6/include/LHAPDF/Makefile.in
LHAPDF-6.1.6/include/LHAPDF/Interpolator.h
LHAPDF-6.1.6/include/LHAPDF/Reweighting.h
LHAPDF-6.1.6/include/LHAPDF/CompositePDF.h
LHAPDF-6.1.6/include/LHAPDF/Info.h
LHAPDF-6.1.6/include/LHAPDF/Extrapolator.h
LHAPDF-6.1.6/include/LHAPDF/NearestPointExtrapolator.h
LHAPDF-6.1.6/include/LHAPDF/Makefile.am
LHAPDF-6.1.6/include/LHAPDF/BicubicInterpolator.h
LHAPDF-6.1.6/include/LHAPDF/Factories.h
LHAPDF-6.1.6/include/LHAPDF/KnotArray.h
LHAPDF-6.1.6/include/LHAPDF/Exceptions.h
LHAPDF-6.1.6/include/LHAPDF/AlphaS.h
LHAPDF-6.1.6/include/LHAPDF/Version.h
LHAPDF-6.1.6/include/LHAPDF/PDFInfo.h
LHAPDF-6.1.6/include/LHAPDF/Utils.h
LHAPDF-6.1.6/include/LHAPDF/GridPDF.h
LHAPDF-6.1.6/include/LHAPDF/PDF.h
LHAPDF-6.1.6/include/LHAPDF/LogBicubicInterpolator.h
LHAPDF-6.1.6/include/LHAPDF/Config.h
LHAPDF-6.1.6/include/LHAPDF/ContinuationExtrapolator.h
LHAPDF-6.1.6/include/LHAPDF/Paths.h
LHAPDF-6.1.6/include/LHAPDF/LHAGlue.h
LHAPDF-6.1.6/doc/
LHAPDF-6.1.6/doc/pdfsets.dox
LHAPDF-6.1.6/doc/Makefile.in
LHAPDF-6.1.6/doc/mkpdflist
LHAPDF-6.1.6/doc/Makefile.am
LHAPDF-6.1.6/doc/Doxyfile.in
LHAPDF-6.1.6/mkindex
LHAPDF-6.1.6/m4/
LHAPDF-6.1.6/m4/ax_cxx_compile_stdcxx_11.m4
LHAPDF-6.1.6/m4/boost.m4
LHAPDF-6.1.6/m4/cython.m4
LHAPDF-6.1.6/m4/ltsugar.m4
LHAPDF-6.1.6/m4/lt~obsolete.m4
LHAPDF-6.1.6/m4/ltoptions.m4
LHAPDF-6.1.6/m4/ltversion.m4
LHAPDF-6.1.6/m4/compilerflags.m4
LHAPDF-6.1.6/m4/boost_bug.m4
LHAPDF-6.1.6/m4/libtool.m4
LHAPDF-6.1.6/wrappers/
LHAPDF-6.1.6/wrappers/python/
LHAPDF-6.1.6/wrappers/python/setup.py.in
LHAPDF-6.1.6/wrappers/python/Makefile.in
LHAPDF-6.1.6/wrappers/python/Makefile.am
LHAPDF-6.1.6/wrappers/python/lhapdf.cpp
LHAPDF-6.1.6/wrappers/python/clhapdf.pxd
LHAPDF-6.1.6/wrappers/python/lhapdf.pyx
LHAPDF-6.1.6/wrappers/Makefile.in
LHAPDF-6.1.6/wrappers/Makefile.am
 Enter LHAPDF6 directory
 Configure LHAPDF
checking for a BSD-compatible install... /usr/bin/install -c
checking whether build environment is sane... yes
checking for a thread-safe mkdir -p... /bin/mkdir -p
checking for gawk... gawk
checking whether make sets $(MAKE)... yes
checking whether make supports nested variables... yes
checking whether make supports nested variables... (cached) yes
checking for sw_vers... no
checking whether the C++ compiler works... yes
checking for C++ compiler default output file name... a.out
checking for suffix of executables...
checking whether we are cross compiling... no
checking for suffix of object files... o
checking whether we are using the GNU C++ compiler... yes
checking whether g++ accepts -g... yes
checking for style of include used by make... GNU
checking dependency style of g++... gcc3
checking whether to include C++11 flag for testing... no
checking for gcc... gcc
checking whether we are using the GNU C compiler... yes
checking whether gcc accepts -g... yes
checking for gcc option to accept ISO C89... none needed
checking whether gcc understands -c and -o together... yes
checking dependency style of gcc... gcc3
checking whether ln -s works... yes
checking build system type... x86_64-unknown-linux-gnu
checking host system type... x86_64-unknown-linux-gnu
checking how to print strings... printf
checking for a sed that does not truncate output... /bin/sed
checking for grep that handles long lines and -e... /bin/grep
checking for egrep... /bin/grep -E
checking for fgrep... /bin/grep -F
checking for ld used by gcc... /usr/bin/ld
checking if the linker (/usr/bin/ld) is GNU ld... yes
checking for BSD- or MS-compatible name lister (nm)... /usr/bin/nm -B
checking the name lister (/usr/bin/nm -B) interface... BSD nm
checking the maximum length of command line arguments... 3458764513820540925
checking whether the shell understands some XSI constructs... yes
checking whether the shell understands "+="... yes
checking how to convert x86_64-unknown-linux-gnu file names to x86_64-unknown-linux-gnu format... func_convert_file_noop
checking how to convert x86_64-unknown-linux-gnu file names to toolchain format... func_convert_file_noop
checking for /usr/bin/ld option to reload object files... -r
checking for objdump... objdump
checking how to recognize dependent libraries... pass_all
checking for dlltool... no
checking how to associate runtime and link libraries... printf %s\n
checking for ar... ar
checking for archiver @FILE support... @
checking for strip... strip
checking for ranlib... ranlib
checking command to parse /usr/bin/nm -B output from gcc object... ok
checking for sysroot... no
checking for mt... no
checking if : is a manifest tool... no
checking how to run the C preprocessor... gcc -E
checking for ANSI C header files... yes
checking for sys/types.h... yes
checking for sys/stat.h... yes
checking for stdlib.h... yes
checking for string.h... yes
checking for memory.h... yes
checking for strings.h... yes
checking for inttypes.h... yes
checking for stdint.h... yes
checking for unistd.h... yes
checking for dlfcn.h... yes
checking for objdir... .libs
checking if gcc supports -fno-rtti -fno-exceptions... no
checking for gcc option to produce PIC... -fPIC -DPIC
checking if gcc PIC flag -fPIC -DPIC works... yes
checking if gcc static flag -static works... no
checking if gcc supports -c -o file.o... yes
checking if gcc supports -c -o file.o... (cached) yes
checking whether the gcc linker (/usr/bin/ld -m elf_x86_64) supports shared libraries... yes
checking whether -lc should be explicitly linked in... no
checking dynamic linker characteristics... GNU/Linux ld.so
checking how to hardcode library paths into programs... immediate
checking whether stripping libraries is possible... yes
checking if libtool supports shared libraries... yes
checking whether to build shared libraries... yes
checking whether to build static libraries... yes
checking how to run the C++ preprocessor... g++ -E
checking for ld used by g++... /usr/bin/ld -m elf_x86_64
checking if the linker (/usr/bin/ld -m elf_x86_64) is GNU ld... yes
checking whether the g++ linker (/usr/bin/ld -m elf_x86_64) supports shared libraries... yes
checking for g++ option to produce PIC... -fPIC -DPIC
checking if g++ PIC flag -fPIC -DPIC works... yes
checking if g++ static flag -static works... no
checking if g++ supports -c -o file.o... yes
checking if g++ supports -c -o file.o... (cached) yes
checking whether the g++ linker (/usr/bin/ld -m elf_x86_64) supports shared libraries... yes
checking dynamic linker characteristics... (cached) GNU/Linux ld.so
checking how to hardcode library paths into programs... immediate
configure: Building LHAGLUE Fortran wrappers
configure: Building LHAGLUE C++ wrappers
checking for pdflatex... no
checking for doxygen... no
checking for python... /usr/bin/python
checking for python version... 2.6
checking for python platform... linux2
checking for python script directory... ${prefix}/lib/python2.6/site-packages
checking for python extension module directory... ${exec_prefix}/lib64/python2.6/site-packages
checking for Cython >= 0.19... no
checking if the g++ compiler accepts the -pedantic flag... yes
checking if the g++ compiler accepts the -Wall flag... yes
checking if the g++ compiler accepts the -Wno-long-long flag... yes
checking if the g++ compiler accepts the -Qunused-arguments flag... no
checking for Boost headers version >= 1.41.0... /home/shibananda/MG5_aMC_v2_5_5/HEPTools/boost/include
checking for Boost's header version... 1_59
checking boost/foreach.hpp usability... yes
checking boost/foreach.hpp presence... yes
checking for boost/foreach.hpp... yes
checking boost/scoped_ptr.hpp usability... yes
checking boost/scoped_ptr.hpp presence... yes
checking for boost/scoped_ptr.hpp... yes
checking boost/shared_ptr.hpp usability... yes
checking boost/shared_ptr.hpp presence... yes
checking for boost/shared_ptr.hpp... yes
checking boost/algorithm/string.hpp usability... yes
checking boost/algorithm/string.hpp presence... yes
checking for boost/algorithm/string.hpp... yes
checking boost/lexical_cast.hpp usability... no
checking boost/lexical_cast.hpp presence... no
checking for boost/lexical_cast.hpp... no
configure: error: cannot find boost/lexical_cast.hpp
 Compile LHAPDF6
make: *** No targets specified and no makefile found. Stop.
 Install LHAPDF6
make: *** No rule to make target `install'. Stop.
copy index and conf file
cp: missing destination file operand after `/home/shibananda/MG5_aMC_v2_5_5/HEPTools/lhapdf6//share/LHAPDF/'
Try `cp --help' for more information.
cp: missing destination file operand after `/home/shibananda/MG5_aMC_v2_5_5/HEPTools/lhapdf6//share/LHAPDF/'
Try `cp --help' for more information.
 Finished LHAPDF6 installation

Command "install pythia8 " interrupted in sub-command:
"install pythia8" with error:
InvalidCmd : Installation of lhapdf6 failed.
MG5_aMC>
========================================

How to get rid of this error ?

Regards,
Shiba

Question information

Language:
English Edit question
Status:
Open
For:
MadGraph5_aMC@NLO Edit question
Assignee:
Valentin Hirschi Edit question
Last query:
2017-08-01
Last reply:
2017-08-01

Hi,

Looks like that you are missing the boost library but the code fails to detect it.
I would advise to start by installing boost (you can do "install boost")
And then install lhapdf6 and then pythia8

Cheers,

Olivier

> On 1 Aug 2017, at 11:58, shibasipu <email address hidden> wrote:
>
> New question #654433 on MadGraph5_aMC@NLO:
> https://answers.launchpad.net/mg5amcnlo/+question/654433
>
> Hi Olivier,
> I am using MG5_aMC_v2_5_5. I was trying to install pythia 8. While installing LHAPDF, it is giving some error message.\
> MG5_aMC> install pythia8
> You are installing 'pythia8', please cite ref(s): arXiv:1410.3012.
> Downloading the HEPToolInstaller at:
> http://madgraph.phys.ucl.ac.be/Downloads/HEPToolsInstaller/HEPToolsInstaller_V86.tar.gz
> LHAPDF was not found. Do you want to install LHPADF6? (recommended) y/n >[y] [60s to answer]
>> y
> Now installing lhapdf6. Be patient...
> --2017-08-01 15:17:46-- http://www.hepforge.org/archive/lhapdf/LHAPDF-6.1.6.tar.gz
> Connecting to 202.141.80.80:3128... connected.
> Proxy request sent, awaiting response... 301 Moved Permanently
> Location: https://www.hepforge.org/archive/lhapdf/LHAPDF-6.1.6.tar.gz [following]
> --2017-08-01 15:17:46-- https://www.hepforge.org/archive/lhapdf/LHAPDF-6.1.6.tar.gz
> Connecting to 202.141.80.80:3128... connected.
> Proxy request sent, awaiting response... 200 OK
> Length: 696608 (680K) [application/x-gzip]
> Saving to: “LHAPDF-6.1.6.tar.gz”
>
> 100%[=========================================================================================================================================================================>] 696,608 270K/s in 2.5s
>
> 2017-08-01 15:17:49 (270 KB/s) - “LHAPDF-6.1.6.tar.gz” saved [696608/696608]
>
> Installing tool 'lhapdf6'...
>> Follow the installation progress by running the command below in a separate terminal)
>> tail -f /home/shibananda/MG5_aMC_v2_5_5/HEPTools/lhapdf6/lhapdf6_install.log
> A problem occured during the installation of 'lhapdf6'.
> Content of the installation log file '/home/shibananda/MG5_aMC_v2_5_5/HEPTools/lhapdf6/lhapdf6_install.log':
>
> Set environment variables
> Unpack LHAPDF
> LHAPDF-6.1.6/
> LHAPDF-6.1.6/aclocal.m4
> LHAPDF-6.1.6/NEWS
> LHAPDF-6.1.6/lhapdf-config.in
> LHAPDF-6.1.6/config/
> LHAPDF-6.1.6/config/test-driver
> LHAPDF-6.1.6/config/compile
> LHAPDF-6.1.6/config/depcomp
> LHAPDF-6.1.6/config/config.h.in
> LHAPDF-6.1.6/config/ltmain.sh
> LHAPDF-6.1.6/config/config.guess
> LHAPDF-6.1.6/config/install-sh
> LHAPDF-6.1.6/config/missing
> LHAPDF-6.1.6/config/config.sub
> LHAPDF-6.1.6/tests/
> LHAPDF-6.1.6/tests/testperf.cc
> LHAPDF-6.1.6/tests/Makefile.in
> LHAPDF-6.1.6/tests/testsetperf.cc
> LHAPDF-6.1.6/tests/testpaths.cc
> LHAPDF-6.1.6/tests/testindex.cc
> LHAPDF-6.1.6/tests/Makefile.am
> LHAPDF-6.1.6/tests/testnsetperf.cc
> LHAPDF-6.1.6/tests/testinfo.cc
> LHAPDF-6.1.6/tests/testgrid.cc
> LHAPDF-6.1.6/tests/testalphas.cc
> LHAPDF-6.1.6/Makefile.in
> LHAPDF-6.1.6/configure.ac
> LHAPDF-6.1.6/configure
> LHAPDF-6.1.6/lhapdf.in
> LHAPDF-6.1.6/ChangeLog
> LHAPDF-6.1.6/lhapdf.pc.in
> LHAPDF-6.1.6/lhapdf.pc
> LHAPDF-6.1.6/TODO
> LHAPDF-6.1.6/INSTALL
> LHAPDF-6.1.6/examples/
> LHAPDF-6.1.6/examples/testpdfunc.py
> LHAPDF-6.1.6/examples/Makefile.in
> LHAPDF-6.1.6/examples/fexample1.f
> LHAPDF-6.1.6/examples/testpdfunc.cc
> LHAPDF-6.1.6/examples/analyticpdf.cc
> LHAPDF-6.1.6/examples/Makefile.am
> LHAPDF-6.1.6/examples/compatibility.cc
> LHAPDF-6.1.6/examples/hessian2replicas.cc
> LHAPDF-6.1.6/examples/pythonexample.py
> LHAPDF-6.1.6/examples/reweight.cc
> LHAPDF-6.1.6/examples/testpdf.cc
> LHAPDF-6.1.6/examples/testpdfset.cc
> LHAPDF-6.1.6/AUTHORS
> LHAPDF-6.1.6/Makefile.am
> LHAPDF-6.1.6/pdfsets.index
> LHAPDF-6.1.6/lhapdf.conf
> LHAPDF-6.1.6/src/
> LHAPDF-6.1.6/src/PDF.cc
> LHAPDF-6.1.6/src/AlphaS.cc
> LHAPDF-6.1.6/src/LogBicubicInterpolator.cc
> LHAPDF-6.1.6/src/Makefile.in
> LHAPDF-6.1.6/src/PDFInfo.cc
> LHAPDF-6.1.6/src/ErrExtrapolator.cc
> LHAPDF-6.1.6/src/AlphaS_ODE.cc
> LHAPDF-6.1.6/src/NearestPointExtrapolator.cc
> LHAPDF-6.1.6/src/Paths.cc
> LHAPDF-6.1.6/src/CompositePDF.cc
> LHAPDF-6.1.6/src/ContinuationExtrapolator.cc
> LHAPDF-6.1.6/src/BilinearInterpolator.cc
> LHAPDF-6.1.6/src/Makefile.am
> LHAPDF-6.1.6/src/Info.cc
> LHAPDF-6.1.6/src/GridPDF.cc
> LHAPDF-6.1.6/src/PDFSet.cc
> LHAPDF-6.1.6/src/Config.cc
> LHAPDF-6.1.6/src/AlphaS_Ipol.cc
> LHAPDF-6.1.6/src/BicubicInterpolator.cc
> LHAPDF-6.1.6/src/LogBilinearInterpolator.cc
> LHAPDF-6.1.6/src/LHAGlue.cc
> LHAPDF-6.1.6/src/Factories.cc
> LHAPDF-6.1.6/src/yamlcpp/
> LHAPDF-6.1.6/src/yamlcpp/emitterstate.cpp
> LHAPDF-6.1.6/src/yamlcpp/yaml-cpp/
> LHAPDF-6.1.6/src/yamlcpp/yaml-cpp/mark.h
> LHAPDF-6.1.6/src/yamlcpp/yaml-cpp/binary.h
> LHAPDF-6.1.6/src/yamlcpp/yaml-cpp/yaml.h
> LHAPDF-6.1.6/src/yamlcpp/yaml-cpp/emittermanip.h
> LHAPDF-6.1.6/src/yamlcpp/yaml-cpp/nodeimpl.h
> LHAPDF-6.1.6/src/yamlcpp/yaml-cpp/eventhandler.h
> LHAPDF-6.1.6/src/yamlcpp/yaml-cpp/noncopyable.h
> LHAPDF-6.1.6/src/yamlcpp/yaml-cpp/parser.h
> LHAPDF-6.1.6/src/yamlcpp/yaml-cpp/stlnode.h
> LHAPDF-6.1.6/src/yamlcpp/yaml-cpp/node.h
> LHAPDF-6.1.6/src/yamlcpp/yaml-cpp/dll.h
> LHAPDF-6.1.6/src/yamlcpp/yaml-cpp/contrib/
> LHAPDF-6.1.6/src/yamlcpp/yaml-cpp/contrib/anchordict.h
> LHAPDF-6.1.6/src/yamlcpp/yaml-cpp/contrib/graphbuilder.h
> LHAPDF-6.1.6/src/yamlcpp/yaml-cpp/traits.h
> LHAPDF-6.1.6/src/yamlcpp/yaml-cpp/null.h
> LHAPDF-6.1.6/src/yamlcpp/yaml-cpp/conversion.h
> LHAPDF-6.1.6/src/yamlcpp/yaml-cpp/emitter.h
> LHAPDF-6.1.6/src/yamlcpp/yaml-cpp/stlemitter.h
> LHAPDF-6.1.6/src/yamlcpp/yaml-cpp/aliasmanager.h
> LHAPDF-6.1.6/src/yamlcpp/yaml-cpp/nodereadimpl.h
> LHAPDF-6.1.6/src/yamlcpp/yaml-cpp/iterator.h
> LHAPDF-6.1.6/src/yamlcpp/yaml-cpp/anchor.h
> LHAPDF-6.1.6/src/yamlcpp/yaml-cpp/emitfromevents.h
> LHAPDF-6.1.6/src/yamlcpp/yaml-cpp/nodeutil.h
> LHAPDF-6.1.6/src/yamlcpp/yaml-cpp/ostream.h
> LHAPDF-6.1.6/src/yamlcpp/yaml-cpp/ltnode.h
> LHAPDF-6.1.6/src/yamlcpp/yaml-cpp/exceptions.h
> LHAPDF-6.1.6/src/yamlcpp/Makefile.in
> LHAPDF-6.1.6/src/yamlcpp/scanner.h
> LHAPDF-6.1.6/src/yamlcpp/nodeownership.cpp
> LHAPDF-6.1.6/src/yamlcpp/scantag.h
> LHAPDF-6.1.6/src/yamlcpp/iterpriv.h
> LHAPDF-6.1.6/src/yamlcpp/node.cpp
> LHAPDF-6.1.6/src/yamlcpp/directives.h
> LHAPDF-6.1.6/src/yamlcpp/stream.h
> LHAPDF-6.1.6/src/yamlcpp/exp.cpp
> LHAPDF-6.1.6/src/yamlcpp/nodebuilder.cpp
> LHAPDF-6.1.6/src/yamlcpp/collectionstack.h
> LHAPDF-6.1.6/src/yamlcpp/scantag.cpp
> LHAPDF-6.1.6/src/yamlcpp/scanner.cpp
> LHAPDF-6.1.6/src/yamlcpp/token.h
> LHAPDF-6.1.6/src/yamlcpp/scantoken.cpp
> LHAPDF-6.1.6/src/yamlcpp/binary.cpp
> LHAPDF-6.1.6/src/yamlcpp/conversion.cpp
> LHAPDF-6.1.6/src/yamlcpp/parser.cpp
> LHAPDF-6.1.6/src/yamlcpp/emitfromevents.cpp
> LHAPDF-6.1.6/src/yamlcpp/setting.h
> LHAPDF-6.1.6/src/yamlcpp/singledocparser.cpp
> LHAPDF-6.1.6/src/yamlcpp/exp.h
> LHAPDF-6.1.6/src/yamlcpp/Makefile.am
> LHAPDF-6.1.6/src/yamlcpp/tag.h
> LHAPDF-6.1.6/src/yamlcpp/streamcharsource.h
> LHAPDF-6.1.6/src/yamlcpp/regex.cpp
> LHAPDF-6.1.6/src/yamlcpp/stream.cpp
> LHAPDF-6.1.6/src/yamlcpp/regex.h
> LHAPDF-6.1.6/src/yamlcpp/regeximpl.h
> LHAPDF-6.1.6/src/yamlcpp/null.cpp
> LHAPDF-6.1.6/src/yamlcpp/scanscalar.h
> LHAPDF-6.1.6/src/yamlcpp/indentation.h
> LHAPDF-6.1.6/src/yamlcpp/nodeownership.h
> LHAPDF-6.1.6/src/yamlcpp/singledocparser.h
> LHAPDF-6.1.6/src/yamlcpp/ptr_vector.h
> LHAPDF-6.1.6/src/yamlcpp/iterator.cpp
> LHAPDF-6.1.6/src/yamlcpp/simplekey.cpp
> LHAPDF-6.1.6/src/yamlcpp/emitter.cpp
> LHAPDF-6.1.6/src/yamlcpp/emitterutils.cpp
> LHAPDF-6.1.6/src/yamlcpp/ostream.cpp
> LHAPDF-6.1.6/src/yamlcpp/directives.cpp
> LHAPDF-6.1.6/src/yamlcpp/scanscalar.cpp
> LHAPDF-6.1.6/src/yamlcpp/emitterstate.h
> LHAPDF-6.1.6/src/yamlcpp/aliasmanager.cpp
> LHAPDF-6.1.6/src/yamlcpp/tag.cpp
> LHAPDF-6.1.6/src/yamlcpp/ptr_stack.h
> LHAPDF-6.1.6/src/yamlcpp/emitterutils.h
> LHAPDF-6.1.6/src/yamlcpp/nodebuilder.h
> LHAPDF-6.1.6/src/yamlcpp/stringsource.h
> LHAPDF-6.1.6/src/AlphaS_Analytic.cc
> LHAPDF-6.1.6/src/Interpolator.cc
> LHAPDF-6.1.6/README
> LHAPDF-6.1.6/COPYING
> LHAPDF-6.1.6/include/
> LHAPDF-6.1.6/include/Makefile.in
> LHAPDF-6.1.6/include/Makefile.am
> LHAPDF-6.1.6/include/LHAPDF/
> LHAPDF-6.1.6/include/LHAPDF/BilinearInterpolator.h
> LHAPDF-6.1.6/include/LHAPDF/Version.h.in
> LHAPDF-6.1.6/include/LHAPDF/PDFSet.h
> LHAPDF-6.1.6/include/LHAPDF/PDFIndex.h
> LHAPDF-6.1.6/include/LHAPDF/ErrExtrapolator.h
> LHAPDF-6.1.6/include/LHAPDF/LHAPDF.h
> LHAPDF-6.1.6/include/LHAPDF/LogBilinearInterpolator.h
> LHAPDF-6.1.6/include/LHAPDF/Makefile.in
> LHAPDF-6.1.6/include/LHAPDF/Interpolator.h
> LHAPDF-6.1.6/include/LHAPDF/Reweighting.h
> LHAPDF-6.1.6/include/LHAPDF/CompositePDF.h
> LHAPDF-6.1.6/include/LHAPDF/Info.h
> LHAPDF-6.1.6/include/LHAPDF/Extrapolator.h
> LHAPDF-6.1.6/include/LHAPDF/NearestPointExtrapolator.h
> LHAPDF-6.1.6/include/LHAPDF/Makefile.am
> LHAPDF-6.1.6/include/LHAPDF/BicubicInterpolator.h
> LHAPDF-6.1.6/include/LHAPDF/Factories.h
> LHAPDF-6.1.6/include/LHAPDF/KnotArray.h
> LHAPDF-6.1.6/include/LHAPDF/Exceptions.h
> LHAPDF-6.1.6/include/LHAPDF/AlphaS.h
> LHAPDF-6.1.6/include/LHAPDF/Version.h
> LHAPDF-6.1.6/include/LHAPDF/PDFInfo.h
> LHAPDF-6.1.6/include/LHAPDF/Utils.h
> LHAPDF-6.1.6/include/LHAPDF/GridPDF.h
> LHAPDF-6.1.6/include/LHAPDF/PDF.h
> LHAPDF-6.1.6/include/LHAPDF/LogBicubicInterpolator.h
> LHAPDF-6.1.6/include/LHAPDF/Config.h
> LHAPDF-6.1.6/include/LHAPDF/ContinuationExtrapolator.h
> LHAPDF-6.1.6/include/LHAPDF/Paths.h
> LHAPDF-6.1.6/include/LHAPDF/LHAGlue.h
> LHAPDF-6.1.6/doc/
> LHAPDF-6.1.6/doc/pdfsets.dox
> LHAPDF-6.1.6/doc/Makefile.in
> LHAPDF-6.1.6/doc/mkpdflist
> LHAPDF-6.1.6/doc/Makefile.am
> LHAPDF-6.1.6/doc/Doxyfile.in
> LHAPDF-6.1.6/mkindex
> LHAPDF-6.1.6/m4/
> LHAPDF-6.1.6/m4/ax_cxx_compile_stdcxx_11.m4
> LHAPDF-6.1.6/m4/boost.m4
> LHAPDF-6.1.6/m4/cython.m4
> LHAPDF-6.1.6/m4/ltsugar.m4
> LHAPDF-6.1.6/m4/lt~obsolete.m4
> LHAPDF-6.1.6/m4/ltoptions.m4
> LHAPDF-6.1.6/m4/ltversion.m4
> LHAPDF-6.1.6/m4/compilerflags.m4
> LHAPDF-6.1.6/m4/boost_bug.m4
> LHAPDF-6.1.6/m4/libtool.m4
> LHAPDF-6.1.6/wrappers/
> LHAPDF-6.1.6/wrappers/python/
> LHAPDF-6.1.6/wrappers/python/setup.py.in
> LHAPDF-6.1.6/wrappers/python/Makefile.in
> LHAPDF-6.1.6/wrappers/python/Makefile.am
> LHAPDF-6.1.6/wrappers/python/lhapdf.cpp
> LHAPDF-6.1.6/wrappers/python/clhapdf.pxd
> LHAPDF-6.1.6/wrappers/python/lhapdf.pyx
> LHAPDF-6.1.6/wrappers/Makefile.in
> LHAPDF-6.1.6/wrappers/Makefile.am
> Enter LHAPDF6 directory
> Configure LHAPDF
> checking for a BSD-compatible install... /usr/bin/install -c
> checking whether build environment is sane... yes
> checking for a thread-safe mkdir -p... /bin/mkdir -p
> checking for gawk... gawk
> checking whether make sets $(MAKE)... yes
> checking whether make supports nested variables... yes
> checking whether make supports nested variables... (cached) yes
> checking for sw_vers... no
> checking whether the C++ compiler works... yes
> checking for C++ compiler default output file name... a.out
> checking for suffix of executables...
> checking whether we are cross compiling... no
> checking for suffix of object files... o
> checking whether we are using the GNU C++ compiler... yes
> checking whether g++ accepts -g... yes
> checking for style of include used by make... GNU
> checking dependency style of g++... gcc3
> checking whether to include C++11 flag for testing... no
> checking for gcc... gcc
> checking whether we are using the GNU C compiler... yes
> checking whether gcc accepts -g... yes
> checking for gcc option to accept ISO C89... none needed
> checking whether gcc understands -c and -o together... yes
> checking dependency style of gcc... gcc3
> checking whether ln -s works... yes
> checking build system type... x86_64-unknown-linux-gnu
> checking host system type... x86_64-unknown-linux-gnu
> checking how to print strings... printf
> checking for a sed that does not truncate output... /bin/sed
> checking for grep that handles long lines and -e... /bin/grep
> checking for egrep... /bin/grep -E
> checking for fgrep... /bin/grep -F
> checking for ld used by gcc... /usr/bin/ld
> checking if the linker (/usr/bin/ld) is GNU ld... yes
> checking for BSD- or MS-compatible name lister (nm)... /usr/bin/nm -B
> checking the name lister (/usr/bin/nm -B) interface... BSD nm
> checking the maximum length of command line arguments... 3458764513820540925
> checking whether the shell understands some XSI constructs... yes
> checking whether the shell understands "+="... yes
> checking how to convert x86_64-unknown-linux-gnu file names to x86_64-unknown-linux-gnu format... func_convert_file_noop
> checking how to convert x86_64-unknown-linux-gnu file names to toolchain format... func_convert_file_noop
> checking for /usr/bin/ld option to reload object files... -r
> checking for objdump... objdump
> checking how to recognize dependent libraries... pass_all
> checking for dlltool... no
> checking how to associate runtime and link libraries... printf %s\n
> checking for ar... ar
> checking for archiver @FILE support... @
> checking for strip... strip
> checking for ranlib... ranlib
> checking command to parse /usr/bin/nm -B output from gcc object... ok
> checking for sysroot... no
> checking for mt... no
> checking if : is a manifest tool... no
> checking how to run the C preprocessor... gcc -E
> checking for ANSI C header files... yes
> checking for sys/types.h... yes
> checking for sys/stat.h... yes
> checking for stdlib.h... yes
> checking for string.h... yes
> checking for memory.h... yes
> checking for strings.h... yes
> checking for inttypes.h... yes
> checking for stdint.h... yes
> checking for unistd.h... yes
> checking for dlfcn.h... yes
> checking for objdir... .libs
> checking if gcc supports -fno-rtti -fno-exceptions... no
> checking for gcc option to produce PIC... -fPIC -DPIC
> checking if gcc PIC flag -fPIC -DPIC works... yes
> checking if gcc static flag -static works... no
> checking if gcc supports -c -o file.o... yes
> checking if gcc supports -c -o file.o... (cached) yes
> checking whether the gcc linker (/usr/bin/ld -m elf_x86_64) supports shared libraries... yes
> checking whether -lc should be explicitly linked in... no
> checking dynamic linker characteristics... GNU/Linux ld.so
> checking how to hardcode library paths into programs... immediate
> checking whether stripping libraries is possible... yes
> checking if libtool supports shared libraries... yes
> checking whether to build shared libraries... yes
> checking whether to build static libraries... yes
> checking how to run the C++ preprocessor... g++ -E
> checking for ld used by g++... /usr/bin/ld -m elf_x86_64
> checking if the linker (/usr/bin/ld -m elf_x86_64) is GNU ld... yes
> checking whether the g++ linker (/usr/bin/ld -m elf_x86_64) supports shared libraries... yes
> checking for g++ option to produce PIC... -fPIC -DPIC
> checking if g++ PIC flag -fPIC -DPIC works... yes
> checking if g++ static flag -static works... no
> checking if g++ supports -c -o file.o... yes
> checking if g++ supports -c -o file.o... (cached) yes
> checking whether the g++ linker (/usr/bin/ld -m elf_x86_64) supports shared libraries... yes
> checking dynamic linker characteristics... (cached) GNU/Linux ld.so
> checking how to hardcode library paths into programs... immediate
> configure: Building LHAGLUE Fortran wrappers
> configure: Building LHAGLUE C++ wrappers
> checking for pdflatex... no
> checking for doxygen... no
> checking for python... /usr/bin/python
> checking for python version... 2.6
> checking for python platform... linux2
> checking for python script directory... ${prefix}/lib/python2.6/site-packages
> checking for python extension module directory... ${exec_prefix}/lib64/python2.6/site-packages
> checking for Cython >= 0.19... no
> checking if the g++ compiler accepts the -pedantic flag... yes
> checking if the g++ compiler accepts the -Wall flag... yes
> checking if the g++ compiler accepts the -Wno-long-long flag... yes
> checking if the g++ compiler accepts the -Qunused-arguments flag... no
> checking for Boost headers version >= 1.41.0... /home/shibananda/MG5_aMC_v2_5_5/HEPTools/boost/include
> checking for Boost's header version... 1_59
> checking boost/foreach.hpp usability... yes
> checking boost/foreach.hpp presence... yes
> checking for boost/foreach.hpp... yes
> checking boost/scoped_ptr.hpp usability... yes
> checking boost/scoped_ptr.hpp presence... yes
> checking for boost/scoped_ptr.hpp... yes
> checking boost/shared_ptr.hpp usability... yes
> checking boost/shared_ptr.hpp presence... yes
> checking for boost/shared_ptr.hpp... yes
> checking boost/algorithm/string.hpp usability... yes
> checking boost/algorithm/string.hpp presence... yes
> checking for boost/algorithm/string.hpp... yes
> checking boost/lexical_cast.hpp usability... no
> checking boost/lexical_cast.hpp presence... no
> checking for boost/lexical_cast.hpp... no
> configure: error: cannot find boost/lexical_cast.hpp
> Compile LHAPDF6
> make: *** No targets specified and no makefile found. Stop.
> Install LHAPDF6
> make: *** No rule to make target `install'. Stop.
> copy index and conf file
> cp: missing destination file operand after `/home/shibananda/MG5_aMC_v2_5_5/HEPTools/lhapdf6//share/LHAPDF/'
> Try `cp --help' for more information.
> cp: missing destination file operand after `/home/shibananda/MG5_aMC_v2_5_5/HEPTools/lhapdf6//share/LHAPDF/'
> Try `cp --help' for more information.
> Finished LHAPDF6 installation
>
> Command "install pythia8 " interrupted in sub-command:
> "install pythia8" with error:
> InvalidCmd : Installation of lhapdf6 failed.
> MG5_aMC>
> ========================================
>
> How to get rid of this error ?
>
>
>
> Regards,
> Shiba
>
> --
> You received this question notification because you are an answer
> contact for MadGraph5_aMC@NLO.

shibasipu (shibasipu) said : #2

Hi Olivier,
                      thanks. I was following the procedures, you had suggested. After successful installation of boost, I was installing lhapdf6.
I am getting the following error message.

MG5_aMC>install lhapdf6
   You are installing 'lhapdf6', please cite ref(s): arXiv:1412.7420.
Downloading the HEPToolInstaller at:
   http://madgraph.physics.illinois.edu/Downloads/HEPToolsInstaller/HEPToolsInstaller_V90.tar.gz
Now installing lhapdf6. Be patient...
Fetching data with command:
  wget --no-check-certificate http://www.hepforge.org/archive/lhapdf/LHAPDF-6.1.6.tar.gz
--2017-08-01 18:38:26-- http://www.hepforge.org/archive/lhapdf/LHAPDF-6.1.6.tar.gz
Connecting to 202.141.80.80:3128... connected.
Proxy request sent, awaiting response... 301 Moved Permanently
Location: https://www.hepforge.org/archive/lhapdf/LHAPDF-6.1.6.tar.gz [following]
--2017-08-01 18:38:26-- https://www.hepforge.org/archive/lhapdf/LHAPDF-6.1.6.tar.gz
Connecting to 202.141.80.80:3128... connected.
Proxy request sent, awaiting response... 200 OK
Length: 696608 (680K) [application/x-gzip]
Saving to: “LHAPDF-6.1.6.tar.gz”

100%[=========================================================================================================================================================================>] 696,608 236K/s in 2.9s

2017-08-01 18:38:30 (236 KB/s) - “LHAPDF-6.1.6.tar.gz” saved [696608/696608]

Installing tool 'lhapdf6'...
    > Follow the installation progress by running the command below in a separate terminal)
    > tail -f /home/shibananda/MG5_aMC_v2_5_5/HEPTools/lhapdf6/lhapdf6_install.log
A problem occured during the installation of 'lhapdf6'.
Content of the installation log file '/home/shibananda/MG5_aMC_v2_5_5/HEPTools/lhapdf6/lhapdf6_install.log':

 Set environment variables
 Unpack LHAPDF
LHAPDF-6.1.6/
LHAPDF-6.1.6/aclocal.m4
LHAPDF-6.1.6/NEWS
LHAPDF-6.1.6/lhapdf-config.in
LHAPDF-6.1.6/config/
LHAPDF-6.1.6/config/test-driver
LHAPDF-6.1.6/config/compile
LHAPDF-6.1.6/config/depcomp
LHAPDF-6.1.6/config/config.h.in
LHAPDF-6.1.6/config/ltmain.sh
LHAPDF-6.1.6/config/config.guess
LHAPDF-6.1.6/config/install-sh
LHAPDF-6.1.6/config/missing
LHAPDF-6.1.6/config/config.sub
LHAPDF-6.1.6/tests/
LHAPDF-6.1.6/tests/testperf.cc
LHAPDF-6.1.6/tests/Makefile.in
LHAPDF-6.1.6/tests/testsetperf.cc
LHAPDF-6.1.6/tests/testpaths.cc
LHAPDF-6.1.6/tests/testindex.cc
LHAPDF-6.1.6/tests/Makefile.am
LHAPDF-6.1.6/tests/testnsetperf.cc
LHAPDF-6.1.6/tests/testinfo.cc
LHAPDF-6.1.6/tests/testgrid.cc
LHAPDF-6.1.6/tests/testalphas.cc
LHAPDF-6.1.6/Makefile.in
LHAPDF-6.1.6/configure.ac
LHAPDF-6.1.6/configure
LHAPDF-6.1.6/lhapdf.in
LHAPDF-6.1.6/ChangeLog
LHAPDF-6.1.6/lhapdf.pc.in
LHAPDF-6.1.6/lhapdf.pc
LHAPDF-6.1.6/TODO
LHAPDF-6.1.6/INSTALL
LHAPDF-6.1.6/examples/
LHAPDF-6.1.6/examples/testpdfunc.py
LHAPDF-6.1.6/examples/Makefile.in
LHAPDF-6.1.6/examples/fexample1.f
LHAPDF-6.1.6/examples/testpdfunc.cc
LHAPDF-6.1.6/examples/analyticpdf.cc
LHAPDF-6.1.6/examples/Makefile.am
LHAPDF-6.1.6/examples/compatibility.cc
LHAPDF-6.1.6/examples/hessian2replicas.cc
LHAPDF-6.1.6/examples/pythonexample.py
LHAPDF-6.1.6/examples/reweight.cc
LHAPDF-6.1.6/examples/testpdf.cc
LHAPDF-6.1.6/examples/testpdfset.cc
LHAPDF-6.1.6/AUTHORS
LHAPDF-6.1.6/Makefile.am
LHAPDF-6.1.6/pdfsets.index
LHAPDF-6.1.6/lhapdf.conf
LHAPDF-6.1.6/src/
LHAPDF-6.1.6/src/PDF.cc
LHAPDF-6.1.6/src/AlphaS.cc
LHAPDF-6.1.6/src/LogBicubicInterpolator.cc
LHAPDF-6.1.6/src/Makefile.in
LHAPDF-6.1.6/src/PDFInfo.cc
LHAPDF-6.1.6/src/ErrExtrapolator.cc
LHAPDF-6.1.6/src/AlphaS_ODE.cc
LHAPDF-6.1.6/src/NearestPointExtrapolator.cc
LHAPDF-6.1.6/src/Paths.cc
LHAPDF-6.1.6/src/CompositePDF.cc
LHAPDF-6.1.6/src/ContinuationExtrapolator.cc
LHAPDF-6.1.6/src/BilinearInterpolator.cc
LHAPDF-6.1.6/src/Makefile.am
LHAPDF-6.1.6/src/Info.cc
LHAPDF-6.1.6/src/GridPDF.cc
LHAPDF-6.1.6/src/PDFSet.cc
LHAPDF-6.1.6/src/Config.cc
LHAPDF-6.1.6/src/AlphaS_Ipol.cc
LHAPDF-6.1.6/src/BicubicInterpolator.cc
LHAPDF-6.1.6/src/LogBilinearInterpolator.cc
LHAPDF-6.1.6/src/LHAGlue.cc
LHAPDF-6.1.6/src/Factories.cc
LHAPDF-6.1.6/src/yamlcpp/
LHAPDF-6.1.6/src/yamlcpp/emitterstate.cpp
LHAPDF-6.1.6/src/yamlcpp/yaml-cpp/
LHAPDF-6.1.6/src/yamlcpp/yaml-cpp/mark.h
LHAPDF-6.1.6/src/yamlcpp/yaml-cpp/binary.h
LHAPDF-6.1.6/src/yamlcpp/yaml-cpp/yaml.h
LHAPDF-6.1.6/src/yamlcpp/yaml-cpp/emittermanip.h
LHAPDF-6.1.6/src/yamlcpp/yaml-cpp/nodeimpl.h
LHAPDF-6.1.6/src/yamlcpp/yaml-cpp/eventhandler.h
LHAPDF-6.1.6/src/yamlcpp/yaml-cpp/noncopyable.h
LHAPDF-6.1.6/src/yamlcpp/yaml-cpp/parser.h
LHAPDF-6.1.6/src/yamlcpp/yaml-cpp/stlnode.h
LHAPDF-6.1.6/src/yamlcpp/yaml-cpp/node.h
LHAPDF-6.1.6/src/yamlcpp/yaml-cpp/dll.h
LHAPDF-6.1.6/src/yamlcpp/yaml-cpp/contrib/
LHAPDF-6.1.6/src/yamlcpp/yaml-cpp/contrib/anchordict.h
LHAPDF-6.1.6/src/yamlcpp/yaml-cpp/contrib/graphbuilder.h
LHAPDF-6.1.6/src/yamlcpp/yaml-cpp/traits.h
LHAPDF-6.1.6/src/yamlcpp/yaml-cpp/null.h
LHAPDF-6.1.6/src/yamlcpp/yaml-cpp/conversion.h
LHAPDF-6.1.6/src/yamlcpp/yaml-cpp/emitter.h
LHAPDF-6.1.6/src/yamlcpp/yaml-cpp/stlemitter.h
LHAPDF-6.1.6/src/yamlcpp/yaml-cpp/aliasmanager.h
LHAPDF-6.1.6/src/yamlcpp/yaml-cpp/nodereadimpl.h
LHAPDF-6.1.6/src/yamlcpp/yaml-cpp/iterator.h
LHAPDF-6.1.6/src/yamlcpp/yaml-cpp/anchor.h
LHAPDF-6.1.6/src/yamlcpp/yaml-cpp/emitfromevents.h
LHAPDF-6.1.6/src/yamlcpp/yaml-cpp/nodeutil.h
LHAPDF-6.1.6/src/yamlcpp/yaml-cpp/ostream.h
LHAPDF-6.1.6/src/yamlcpp/yaml-cpp/ltnode.h
LHAPDF-6.1.6/src/yamlcpp/yaml-cpp/exceptions.h
LHAPDF-6.1.6/src/yamlcpp/Makefile.in
LHAPDF-6.1.6/src/yamlcpp/scanner.h
LHAPDF-6.1.6/src/yamlcpp/nodeownership.cpp
LHAPDF-6.1.6/src/yamlcpp/scantag.h
LHAPDF-6.1.6/src/yamlcpp/iterpriv.h
LHAPDF-6.1.6/src/yamlcpp/node.cpp
LHAPDF-6.1.6/src/yamlcpp/directives.h
LHAPDF-6.1.6/src/yamlcpp/stream.h
LHAPDF-6.1.6/src/yamlcpp/exp.cpp
LHAPDF-6.1.6/src/yamlcpp/nodebuilder.cpp
LHAPDF-6.1.6/src/yamlcpp/collectionstack.h
LHAPDF-6.1.6/src/yamlcpp/scantag.cpp
LHAPDF-6.1.6/src/yamlcpp/scanner.cpp
LHAPDF-6.1.6/src/yamlcpp/token.h
LHAPDF-6.1.6/src/yamlcpp/scantoken.cpp
LHAPDF-6.1.6/src/yamlcpp/binary.cpp
LHAPDF-6.1.6/src/yamlcpp/conversion.cpp
LHAPDF-6.1.6/src/yamlcpp/parser.cpp
LHAPDF-6.1.6/src/yamlcpp/emitfromevents.cpp
LHAPDF-6.1.6/src/yamlcpp/setting.h
LHAPDF-6.1.6/src/yamlcpp/singledocparser.cpp
LHAPDF-6.1.6/src/yamlcpp/exp.h
LHAPDF-6.1.6/src/yamlcpp/Makefile.am
LHAPDF-6.1.6/src/yamlcpp/tag.h
LHAPDF-6.1.6/src/yamlcpp/streamcharsource.h
LHAPDF-6.1.6/src/yamlcpp/regex.cpp
LHAPDF-6.1.6/src/yamlcpp/stream.cpp
LHAPDF-6.1.6/src/yamlcpp/regex.h
LHAPDF-6.1.6/src/yamlcpp/regeximpl.h
LHAPDF-6.1.6/src/yamlcpp/null.cpp
LHAPDF-6.1.6/src/yamlcpp/scanscalar.h
LHAPDF-6.1.6/src/yamlcpp/indentation.h
LHAPDF-6.1.6/src/yamlcpp/nodeownership.h
LHAPDF-6.1.6/src/yamlcpp/singledocparser.h
LHAPDF-6.1.6/src/yamlcpp/ptr_vector.h
LHAPDF-6.1.6/src/yamlcpp/iterator.cpp
LHAPDF-6.1.6/src/yamlcpp/simplekey.cpp
LHAPDF-6.1.6/src/yamlcpp/emitter.cpp
LHAPDF-6.1.6/src/yamlcpp/emitterutils.cpp
LHAPDF-6.1.6/src/yamlcpp/ostream.cpp
LHAPDF-6.1.6/src/yamlcpp/directives.cpp
LHAPDF-6.1.6/src/yamlcpp/scanscalar.cpp
LHAPDF-6.1.6/src/yamlcpp/emitterstate.h
LHAPDF-6.1.6/src/yamlcpp/aliasmanager.cpp
LHAPDF-6.1.6/src/yamlcpp/tag.cpp
LHAPDF-6.1.6/src/yamlcpp/ptr_stack.h
LHAPDF-6.1.6/src/yamlcpp/emitterutils.h
LHAPDF-6.1.6/src/yamlcpp/nodebuilder.h
LHAPDF-6.1.6/src/yamlcpp/stringsource.h
LHAPDF-6.1.6/src/AlphaS_Analytic.cc
LHAPDF-6.1.6/src/Interpolator.cc
LHAPDF-6.1.6/README
LHAPDF-6.1.6/COPYING
LHAPDF-6.1.6/include/
LHAPDF-6.1.6/include/Makefile.in
LHAPDF-6.1.6/include/Makefile.am
LHAPDF-6.1.6/include/LHAPDF/
LHAPDF-6.1.6/include/LHAPDF/BilinearInterpolator.h
LHAPDF-6.1.6/include/LHAPDF/Version.h.in
LHAPDF-6.1.6/include/LHAPDF/PDFSet.h
LHAPDF-6.1.6/include/LHAPDF/PDFIndex.h
LHAPDF-6.1.6/include/LHAPDF/ErrExtrapolator.h
LHAPDF-6.1.6/include/LHAPDF/LHAPDF.h
LHAPDF-6.1.6/include/LHAPDF/LogBilinearInterpolator.h
LHAPDF-6.1.6/include/LHAPDF/Makefile.in
LHAPDF-6.1.6/include/LHAPDF/Interpolator.h
LHAPDF-6.1.6/include/LHAPDF/Reweighting.h
LHAPDF-6.1.6/include/LHAPDF/CompositePDF.h
LHAPDF-6.1.6/include/LHAPDF/Info.h
LHAPDF-6.1.6/include/LHAPDF/Extrapolator.h
LHAPDF-6.1.6/include/LHAPDF/NearestPointExtrapolator.h
LHAPDF-6.1.6/include/LHAPDF/Makefile.am
LHAPDF-6.1.6/include/LHAPDF/BicubicInterpolator.h
LHAPDF-6.1.6/include/LHAPDF/Factories.h
LHAPDF-6.1.6/include/LHAPDF/KnotArray.h
LHAPDF-6.1.6/include/LHAPDF/Exceptions.h
LHAPDF-6.1.6/include/LHAPDF/AlphaS.h
LHAPDF-6.1.6/include/LHAPDF/Version.h
LHAPDF-6.1.6/include/LHAPDF/PDFInfo.h
LHAPDF-6.1.6/include/LHAPDF/Utils.h
LHAPDF-6.1.6/include/LHAPDF/GridPDF.h
LHAPDF-6.1.6/include/LHAPDF/PDF.h
LHAPDF-6.1.6/include/LHAPDF/LogBicubicInterpolator.h
LHAPDF-6.1.6/include/LHAPDF/Config.h
LHAPDF-6.1.6/include/LHAPDF/ContinuationExtrapolator.h
LHAPDF-6.1.6/include/LHAPDF/Paths.h
LHAPDF-6.1.6/include/LHAPDF/LHAGlue.h
LHAPDF-6.1.6/doc/
LHAPDF-6.1.6/doc/pdfsets.dox
LHAPDF-6.1.6/doc/Makefile.in
LHAPDF-6.1.6/doc/mkpdflist
LHAPDF-6.1.6/doc/Makefile.am
LHAPDF-6.1.6/doc/Doxyfile.in
LHAPDF-6.1.6/mkindex
LHAPDF-6.1.6/m4/
LHAPDF-6.1.6/m4/ax_cxx_compile_stdcxx_11.m4
LHAPDF-6.1.6/m4/boost.m4
LHAPDF-6.1.6/m4/cython.m4
LHAPDF-6.1.6/m4/ltsugar.m4
LHAPDF-6.1.6/m4/lt~obsolete.m4
LHAPDF-6.1.6/m4/ltoptions.m4
LHAPDF-6.1.6/m4/ltversion.m4
LHAPDF-6.1.6/m4/compilerflags.m4
LHAPDF-6.1.6/m4/boost_bug.m4
LHAPDF-6.1.6/m4/libtool.m4
LHAPDF-6.1.6/wrappers/
LHAPDF-6.1.6/wrappers/python/
LHAPDF-6.1.6/wrappers/python/setup.py.in
LHAPDF-6.1.6/wrappers/python/Makefile.in
LHAPDF-6.1.6/wrappers/python/Makefile.am
LHAPDF-6.1.6/wrappers/python/lhapdf.cpp
LHAPDF-6.1.6/wrappers/python/clhapdf.pxd
LHAPDF-6.1.6/wrappers/python/lhapdf.pyx
LHAPDF-6.1.6/wrappers/Makefile.in
LHAPDF-6.1.6/wrappers/Makefile.am
 Enter LHAPDF6 directory
 Configure LHAPDF
checking for a BSD-compatible install... /usr/bin/install -c
checking whether build environment is sane... yes
checking for a thread-safe mkdir -p... /bin/mkdir -p
checking for gawk... gawk
checking whether make sets $(MAKE)... yes
checking whether make supports nested variables... yes
checking whether make supports nested variables... (cached) yes
checking for sw_vers... no
checking whether the C++ compiler works... yes
checking for C++ compiler default output file name... a.out
checking for suffix of executables...
checking whether we are cross compiling... no
checking for suffix of object files... o
checking whether we are using the GNU C++ compiler... yes
checking whether g++ accepts -g... yes
checking for style of include used by make... GNU
checking dependency style of g++... gcc3
checking whether to include C++11 flag for testing... no
checking for gcc... gcc
checking whether we are using the GNU C compiler... yes
checking whether gcc accepts -g... yes
checking for gcc option to accept ISO C89... none needed
checking whether gcc understands -c and -o together... yes
checking dependency style of gcc... gcc3
checking whether ln -s works... yes
checking build system type... x86_64-unknown-linux-gnu
checking host system type... x86_64-unknown-linux-gnu
checking how to print strings... printf
checking for a sed that does not truncate output... /bin/sed
checking for grep that handles long lines and -e... /bin/grep
checking for egrep... /bin/grep -E
checking for fgrep... /bin/grep -F
checking for ld used by gcc... /usr/bin/ld
checking if the linker (/usr/bin/ld) is GNU ld... yes
checking for BSD- or MS-compatible name lister (nm)... /usr/bin/nm -B
checking the name lister (/usr/bin/nm -B) interface... BSD nm
checking the maximum length of command line arguments... 3458764513820540925
checking whether the shell understands some XSI constructs... yes
checking whether the shell understands "+="... yes
checking how to convert x86_64-unknown-linux-gnu file names to x86_64-unknown-linux-gnu format... func_convert_file_noop
checking how to convert x86_64-unknown-linux-gnu file names to toolchain format... func_convert_file_noop
checking for /usr/bin/ld option to reload object files... -r
checking for objdump... objdump
checking how to recognize dependent libraries... pass_all
checking for dlltool... no
checking how to associate runtime and link libraries... printf %s\n
checking for ar... ar
checking for archiver @FILE support... @
checking for strip... strip
checking for ranlib... ranlib
checking command to parse /usr/bin/nm -B output from gcc object... ok
checking for sysroot... no
checking for mt... no
checking if : is a manifest tool... no
checking how to run the C preprocessor... gcc -E
checking for ANSI C header files... yes
checking for sys/types.h... yes
checking for sys/stat.h... yes
checking for stdlib.h... yes
checking for string.h... yes
checking for memory.h... yes
checking for strings.h... yes
checking for inttypes.h... yes
checking for stdint.h... yes
checking for unistd.h... yes
checking for dlfcn.h... yes
checking for objdir... .libs
checking if gcc supports -fno-rtti -fno-exceptions... no
checking for gcc option to produce PIC... -fPIC -DPIC
checking if gcc PIC flag -fPIC -DPIC works... yes
checking if gcc static flag -static works... no
checking if gcc supports -c -o file.o... yes
checking if gcc supports -c -o file.o... (cached) yes
checking whether the gcc linker (/usr/bin/ld -m elf_x86_64) supports shared libraries... yes
checking whether -lc should be explicitly linked in... no
checking dynamic linker characteristics... GNU/Linux ld.so
checking how to hardcode library paths into programs... immediate
checking whether stripping libraries is possible... yes
checking if libtool supports shared libraries... yes
checking whether to build shared libraries... yes
checking whether to build static libraries... yes
checking how to run the C++ preprocessor... g++ -E
checking for ld used by g++... /usr/bin/ld -m elf_x86_64
checking if the linker (/usr/bin/ld -m elf_x86_64) is GNU ld... yes
checking whether the g++ linker (/usr/bin/ld -m elf_x86_64) supports shared libraries... yes
checking for g++ option to produce PIC... -fPIC -DPIC
checking if g++ PIC flag -fPIC -DPIC works... yes
checking if g++ static flag -static works... no
checking if g++ supports -c -o file.o... yes
checking if g++ supports -c -o file.o... (cached) yes
checking whether the g++ linker (/usr/bin/ld -m elf_x86_64) supports shared libraries... yes
checking dynamic linker characteristics... (cached) GNU/Linux ld.so
checking how to hardcode library paths into programs... immediate
configure: Building LHAGLUE Fortran wrappers
configure: Building LHAGLUE C++ wrappers
checking for pdflatex... no
checking for doxygen... no
checking for python... /usr/bin/python
checking for python version... 2.6
checking for python platform... linux2
checking for python script directory... ${prefix}/lib/python2.6/site-packages
checking for python extension module directory... ${exec_prefix}/lib64/python2.6/site-packages
checking for Cython >= 0.19... no
checking if the g++ compiler accepts the -pedantic flag... yes
checking if the g++ compiler accepts the -Wall flag... yes
checking if the g++ compiler accepts the -Wno-long-long flag... yes
checking if the g++ compiler accepts the -Qunused-arguments flag... no
checking for Boost headers version >= 1.41.0... /home/shibananda/MG5_aMC_v2_5_5/HEPTools/boost/include
checking for Boost's header version... 1_59
checking boost/foreach.hpp usability... yes
checking boost/foreach.hpp presence... yes
checking for boost/foreach.hpp... yes
checking boost/scoped_ptr.hpp usability... yes
checking boost/scoped_ptr.hpp presence... yes
checking for boost/scoped_ptr.hpp... yes
checking boost/shared_ptr.hpp usability... yes
checking boost/shared_ptr.hpp presence... yes
checking for boost/shared_ptr.hpp... yes
checking boost/algorithm/string.hpp usability... yes
checking boost/algorithm/string.hpp presence... yes
checking for boost/algorithm/string.hpp... yes
checking boost/lexical_cast.hpp usability... no
checking boost/lexical_cast.hpp presence... no
checking for boost/lexical_cast.hpp... no
configure: error: cannot find boost/lexical_cast.hpp
 Compile LHAPDF6
make: *** No targets specified and no makefile found. Stop.
 Install LHAPDF6
make: *** No rule to make target `install'. Stop.
copy index and conf file
cp: missing destination file operand after `/home/shibananda/MG5_aMC_v2_5_5/HEPTools/lhapdf6//share/LHAPDF/'
Try `cp --help' for more information.
cp: missing destination file operand after `/home/shibananda/MG5_aMC_v2_5_5/HEPTools/lhapdf6//share/LHAPDF/'
Try `cp --help' for more information.
 Finished LHAPDF6 installation

Command "install lhapdf6" interrupted with error:
InvalidCmd : Installation of lhapdf6 failed.
=================================================
Please suggest how to get rid of this error.

Regards,
Shiba

Can you help with this problem?

Provide an answer of your own, or ask shibasipu for more information if necessary.

To post a message you must log in.