Questions for Duplicity

              
Summary Created Submitter Assignee Status
Solved 270906 Memory requirements of duplicity with gpg and bzip2 2015-08-30 09:38:18 UTC 2015-08-30 Hannes Ebner Solved
Answered 270826 Patching error 2015-08-27 08:58:20 UTC 2015-08-27 luciano tolomei Answered
Solved 270812 Overflow error signed integer is greater than maximum 2015-08-26 19:08:21 UTC 2015-08-26 juniorfga Solved
Solved 270299 --- Finished state FAILED 'code 23' 2015-08-12 16:29:46 UTC 2015-08-12 juniorfga Solved
Answered 269945 If lockfile is not released on crash, subsequent backups fail 2015-08-03 12:40:38 UTC 2015-08-03 grimborg Answered
Solved 269451 Finished state FAILED 'code 30' 2015-07-20 14:53:15 UTC 2015-07-20 juniorfga Solved
Solved 269338 --- Finished state FAILED 'code 3' at 09:46:10.290 - Runtime 00:00:01.314 --- 2015-07-17 14:08:16 UTC 2015-07-17 juniorfga Solved
Answered 268927 Multi-Thread FTP Uploads? 2015-07-06 13:07:01 UTC 2015-07-06 Martin Klefas Answered
Answered 267504 Unable to fetch single file or specific file via duply 2015-05-28 17:22:43 UTC 2015-05-28 satish kumar Answered
Solved 267099 Help! No backup chains found! 2015-05-19 03:27:13 UTC 2015-05-19 NAL Solved
Solved 265025 Install to FreeNAS 2015-04-12 02:25:58 UTC 2015-04-12 A.M. Solved
Answered 264755 ubuntu14.04 LTS / duplicity 0.6.23 / hash trouble when trying to restore 2015-04-07 20:15:12 UTC 2015-04-07 Andreas Answered
Answered 264557 duplicity: Invalid data - SHA1 hash mismatch for file 2015-04-03 16:16:18 UTC 2015-04-03 Domoradov Alex Answered
Answered 263976 High usage of /tmp when downloading signatures file for verification 2015-03-22 01:00:12 UTC 2015-03-22 Marco B. Answered
Solved 263044 ERROR 30 UnicodeDecodeError 2015-03-01 16:17:27 UTC 2015-03-01 Vera Schmidt Solved
Solved 263004 Incremental backup fails on crontab 2015-02-28 21:36:32 UTC 2015-02-28 A.M. Solved
Solved 262699 GUI for Duplicity Backup/Restore 2015-02-24 13:38:38 UTC 2015-02-24 ozdroggy Solved
Solved 261968 duply backup fails with Finished state FAILED 'code 23' 2015-02-11 17:04:59 UTC 2015-02-11 satish kumar Solved
Solved 261866 How to use --include-filelist-stdin or --exclude-filelist-stdin 2015-02-09 11:59:55 UTC 2015-02-09 Aaron Whitehouse Solved
Answered 261358 limit incremental backup to list of changed files 2015-01-28 19:49:04 UTC 2015-01-28 Thomas Tanner Answered
Solved 261028 BackendException error with S3 2015-01-21 10:31:11 UTC 2015-01-21 Bakos Attila Solved
Solved 259173 rsync backend fails 2014-12-17 02:17:01 UTC 2014-12-17 Steven Solved
Answered 258043 In Mac OS X 10.8.8 Mountain Lion - ERROR: BackendException: Could not initialize backend: No module named Crypto.PublicKey 2014-11-22 11:10:46 UTC 2014-11-22 Chuck Answered
Solved 257755 Receiving multiple e-mails 2014-11-17 12:30:01 UTC 2014-11-17 Pedro Guizeline Solved
Solved 256352 Any way to backup to Microsoft Onedrive? 2014-10-29 13:31:36 UTC 2014-10-29 cp Solved
Answered 256351 Error with dropbox backend after upgrade to 0.7.0 2014-10-29 13:27:15 UTC 2014-10-29 cp Answered
Solved 256329 Duration of verifying 2014-10-28 23:36:16 UTC 2014-10-28 A.M. Solved
Answered 256248 duplicity can use external compression program as pigz (for speed up)? 2014-10-27 10:59:50 UTC 2014-10-27 Shevtsov-anton Answered
Solved 255903 Release date for Milestone 0.6.25 2014-10-18 10:58:15 UTC 2014-10-18 John Leach Solved
Solved 255740 Dropbox backend: global name 'rest' is not defined when changing app id and secret 2014-10-15 02:20:16 UTC 2014-10-15 Cyrus David Solved
Answered 255082 Swift is working but duplicity is unable to upload a file 2014-09-27 20:53:54 UTC 2014-09-27 stephane Answered
Answered 254765 Error release_lockfile 2014-09-20 08:57:07 UTC 2014-09-20 Bellantuono Daniel Answered
Solved 254398 Google Drive - Files are duplicate in specified Subfolder and "My Drive" Rootfolder 2014-09-12 13:48:30 UTC 2014-09-12 Jan Brenner Solved
Answered 253609 Amazone S3 Connection Reset by peer 2014-08-26 06:13:55 UTC 2014-08-26 Gaurav Ashtikar Answered
Solved 252898 ImportError (progress) when setting up for development 2014-08-10 14:35:57 UTC 2014-08-10 Aaron Whitehouse Solved
Solved 252663 temp_dir /tmp not recognizing free space 2014-08-05 15:53:18 UTC 2014-08-05 gustavo maurizio Solved
Solved 251493 Gnupg2 support 2014-07-10 21:31:45 UTC 2014-07-10 markas Solved
Answered 250898 Is there any easy way to make duplicity support AWS IAM instance role when uploading to s3 2014-06-28 11:38:20 UTC 2014-06-28 patrickshan Answered
Solved 250357 FTP fails from root directory 2014-06-17 10:36:19 UTC 2014-06-17 gobbo Solved
Answered 250273 Merge diffs so no new complete backup is required 2014-06-15 20:57:33 UTC 2014-06-15 gamana Answered
Answered 250249 BackendException: ssh connection to dale@192.168.0.13:22 failed: No authentication methods available 2014-06-14 19:17:26 UTC 2014-06-14 Dale Poulter Answered
Answered 249971 Is "--use-compress-program" option missing? 2014-06-09 12:53:33 UTC 2014-06-09 Miro Answered
Answered 248689 Restore full backup 2014-05-14 20:43:54 UTC 2014-05-14 A.M. Answered
Answered 248646 Problem with Deja Dub Data Recovery 2014-05-13 20:57:57 UTC 2014-05-13 Mitradeva Answered
Answered 248210 Fatal Error & Question 2014-05-05 20:25:04 UTC 2014-05-05 A.M. Answered
Solved 248208 Releasedate Milestone 0.6.24 2014-05-05 19:45:57 UTC 2014-05-05 Maximilian von Zweydorff Solved
Open 248111 Duplicity Adds the same file again after full backup 2014-05-03 18:54:44 UTC 2014-05-03 Rodrigo Alvarez Open
Solved 248020 WebDAV "SSLError: The read operation timed out" on goneo.de 2014-05-01 23:39:35 UTC 2014-05-01 A.M. Solved
Solved 246468 A key used to sign downloads 2014-04-03 15:17:02 UTC 2014-04-03 faultybit Solved
Answered 246088 restore fails for file listed in list-current-files? 2014-03-26 15:15:13 UTC 2014-03-26 Ted Answered
Solved 245196 Is it possible to remove a specific backup chain? 2014-03-09 02:11:18 UTC 2014-03-09 Martin Abbrent Solved
Solved 245190 Exclude subfolders in included directories with exclude globbing filelist 2014-03-08 23:30:19 UTC 2014-03-08 Martin Abbrent Solved
Solved 245129 Duplicity 0.6.22 restore fails with error code 21 2014-03-07 11:43:53 UTC 2014-03-07 Daniel Hobi Solved
Solved 244918 Dropbox backend: Attempt 1 failed. NameError: global name 'rest' is not defined 2014-03-03 19:59:08 UTC 2014-03-03 Jakob Solved
Answered 244553 WebDav backup restore fails with ExpatError 2014-02-25 14:44:50 UTC 2014-02-25 Chris Answered
Solved 244419 Full system backup fails at verification stage with an AssertionError: [(('README',) reg) 2014-02-22 20:42:18 UTC 2014-02-22 papukaija Solved
Answered 242530 difficulty by restoring data 2014-01-21 14:56:01 UTC 2014-01-21 Johannes Tod Answered
Solved 241395 'Full' backup set displayed by 'collection-status' only reports 1287 of 3192 volumes 2013-12-29 02:41:39 UTC 2013-12-29 Jonathan Elchison Solved
Open 240242 Duplicity downloads old signatures when they are irrelevant for the task in hand? 2013-12-03 18:33:17 UTC 2013-12-03 Dan Flexy Open
Answered 239432 Why duplicity has no option to restore full backups ignoring missing signature files? 2013-11-18 22:38:16 UTC 2013-11-18 Dan Flexy Answered
Answered 237450 Wrong output of "verify --file-to-restore" 2013-10-16 16:55:44 UTC 2013-10-16 Eugene Vandyuk Answered
Solved 236750 practical limit on the number of incrementals? 2013-10-03 01:41:18 UTC 2013-10-03 Gábor Lipták Solved
Answered 236122 Mega.co.nz backend usage 2013-09-22 05:24:40 UTC 2013-09-22 iox Answered
Solved 235468 Can't backup into a directory 2013-09-10 17:27:54 UTC 2013-09-10 Tim Chi Solved
Answered 234795 Unable to get collection-status - AssertionError 2013-08-28 19:31:35 UTC 2013-08-28 sebastian-s Answered
Solved 232611 Error running rsync 2013-07-17 16:53:25 UTC 2013-07-17 Tim Chi Solved
Answered 232566 First-time backup GPG Usage Error 2013-07-17 00:39:32 UTC 2013-07-17 Kevin Granger Answered
Answered 232504 Adding/Removing folders via include/excludes after the fact 2013-07-15 21:36:07 UTC 2013-07-15 Will Ashworth Answered
Solved 231321 Import of duplicity.backends.webdavbackend and Import of duplicity.backends.u1backend Failed 2013-06-25 05:01:37 UTC 2013-06-25 Tinh Solved
Answered 231300 Centos 6.3 and Authentication failed 2013-06-24 17:58:22 UTC 2013-06-24 R.Roberts Answered
Answered 231215 problem with manual parallel installation of duplicity 0.6.21 2013-06-23 10:08:07 UTC 2013-06-23 Vera Schmidt Answered
Answered 229336 module object has no attribute pydevd 2013-05-21 14:59:47 UTC 2013-05-21 Bryan Answered
Solved 228855 Duplicity does not recognize Network down - full backup is not complete 2013-05-14 12:04:12 UTC 2013-05-14 Paul Bernet Solved
Solved 228587 Get the exit status of duplicity 2013-05-10 12:03:16 UTC 2013-05-10 Henrik Solved
Solved 228382 Would it be a problem if some files were falsely assumed to be unchanged in one scan? 2013-05-08 00:32:28 UTC 2013-05-08 Daan W. Solved
175 of 179 results

Answer contacts for Duplicity