awn-extras fails to make Slackware 12.2

Asked by bender on 2009-07-31

Using slackware 12.2, ./configure without errors. make fails.

bash-3.1# make
make all-recursive
make[1]: Entering directory `/home/roark/Downloads/awn-extras-applets-0.3.2'
Making all in src
make[2]: Entering directory `/home/roark/Downloads/awn-extras-applets-0.3.2/src'
Making all in libawn-extras
make[3]: Entering directory `/home/roark/Downloads/awn-extras-applets-0.3.2/src/libawn-extras'
Making all in .
make[4]: Entering directory `/home/roark/Downloads/awn-extras-applets-0.3.2/src/libawn-extras'
make[4]: Nothing to be done for `all-am'.
make[4]: Leaving directory `/home/roark/Downloads/awn-extras-applets-0.3.2/src/libawn-extras'
Making all in bindings
make[4]: Entering directory `/home/roark/Downloads/awn-extras-applets-0.3.2/src/libawn-extras/bindings'
Making all in python
make[5]: Entering directory `/home/roark/Downloads/awn-extras-applets-0.3.2/src/libawn-extras/bindings/python'
make[5]: Nothing to be done for `all'.
make[5]: Leaving directory `/home/roark/Downloads/awn-extras-applets-0.3.2/src/libawn-extras/bindings/python'
Making all in vala
make[5]: Entering directory `/home/roark/Downloads/awn-extras-applets-0.3.2/src/libawn-extras/bindings/vala'
make[5]: Nothing to be done for `all'.
make[5]: Leaving directory `/home/roark/Downloads/awn-extras-applets-0.3.2/src/libawn-extras/bindings/vala'
make[5]: Entering directory `/home/roark/Downloads/awn-extras-applets-0.3.2/src/libawn-extras/bindings'
make[5]: Nothing to be done for `all-am'.
make[5]: Leaving directory `/home/roark/Downloads/awn-extras-applets-0.3.2/src/libawn-extras/bindings'
make[4]: Leaving directory `/home/roark/Downloads/awn-extras-applets-0.3.2/src/libawn-extras/bindings'
make[3]: Leaving directory `/home/roark/Downloads/awn-extras-applets-0.3.2/src/libawn-extras'
Making all in animal-farm
make[3]: Entering directory `/home/roark/Downloads/awn-extras-applets-0.3.2/src/animal-farm'
make[3]: Nothing to be done for `all'.
make[3]: Leaving directory `/home/roark/Downloads/awn-extras-applets-0.3.2/src/animal-farm'
Making all in arss
make[3]: Entering directory `/home/roark/Downloads/awn-extras-applets-0.3.2/src/arss'
/usr/local/bin/awn-schema-to-gconf arss.schema-ini arss.schemas.in "arss"
/bin/sh: /usr/local/bin/awn-schema-to-gconf: No such file or directory
make[3]: *** [arss.schemas.in] Error 127
make[3]: Leaving directory `/home/roark/Downloads/awn-extras-applets-0.3.2/src/arss'
make[2]: *** [all-recursive] Error 1
make[2]: Leaving directory `/home/roark/Downloads/awn-extras-applets-0.3.2/src'
make[1]: *** [all-recursive] Error 1
make[1]: Leaving directory `/home/roark/Downloads/awn-extras-applets-0.3.2'
make: *** [all] Error 2

Question information

Language:
English Edit question
Status:
Answered
For:
Awn Extras Edit question
Assignee:
No assignee Edit question
Last query:
2009-07-31
Last reply:
2009-07-31
Mark Lee (malept) said : #1

It seems that `make install` did not run correctly when you installed Awn, because awn-schema-to-gconf is installed when Awn is installed.

FWIW, the latest version of Awn Extras is 0.3.2.2.

bender (brandon-fowler) said : #2

Could it have installedd in the wrong location? Awn and awn-manager seem to run without error.

Mark Lee (malept) said : #3

I doubt that it installed in the wrong location.

What version of Awn do you have installed?

bender (brandon-fowler) said : #4

avant-window-navigator-0.3.2

Mark Lee (malept) said : #5

I would reinstall Awn (0.3.2.1 is currently the latest version, although that shouldn't matter in this case), and then try installing Awn Extras again. When reinstalling Awn, try to save the build log to a file, in case awn-schema-to-gconf isn't installed again.

Can you help with this problem?

Provide an answer of your own, or ask bender for more information if necessary.

To post a message you must log in.